program: Gaussian 09
title: 000190194
version: EM64L-G09RevD.01
frameworkgroup: C1[X(C19H16O2)]
method: RPBEPBE
basis: SDD
operation: Freq
keyword: #pfreq=noraman
keyword: PBEPBE/SDD
title: #p freq=noraman PBEPBE/SDD
converged: YES YES NO NO
title: Mulliken charges:
elementType: O O C C C C C C C C C C C C C C C C C C C H H H H H H H H H H H H H H H H
charge: -0.469983 -0.443433 0.101188 0.297942 -0.233353 0.383572 -0.655637 -0.762050 0.239590 0.466254 -0.308133 -0.637790 -0.399070 0.196568 -0.501004 0.424161 -0.477074 -0.369869 -0.433346 -0.260375 -0.249831 0.283597 0.288956 0.255308 0.234351 0.212279 0.245397 0.229967 0.238790 0.359011 0.246531 0.235671 0.341906 0.223062 0.240116 0.227351 0.229379
chargesum: 0.00000
title: Mulliken charges with hydrogens summed into heavy atoms:
elementType: O O C C C C C C C C C C C C C C C C C C C
charge: -0.110972 -0.101527 0.101188 0.297942 0.050244 0.383572 -0.366681 -0.060111 0.239590 0.466254 -0.062736 -0.407823 -0.160279 0.196568 -0.254473 0.424161 -0.241404 -0.146807 -0.193230 -0.033025 -0.020452
polarizability: 3.97382842e+02 -7.36542862e+00 2.16168208e+02 -1.12963317e+00 -4.79158526e+00 1.01871355e+02
1716.lowfreq: -8.9782 -2.1744 -0.0008 -0.0006 -0.0006 10.7841 47.0752 56.2720 99.5373
frequency: 46.8339 56.2557 99.5352 130.2102 147.8842 157.6582 212.6926 218.4043 234.1562 242.7178 276.3191 286.2508 323.2377 352.0329 372.1680 377.7387 401.2292 423.6334 430.8668 451.7978 460.7079 467.6426 494.9392 498.8289 529.9458 537.7979 548.7509 572.4102 623.1431 646.9173 675.8003 706.4435 717.2001 738.0709 756.2839 758.0537 777.3347 802.1406 811.4784 836.6232 843.4979 871.7039 885.7021 907.7855 915.0251 938.4410 947.1633 958.0219 972.4746 982.9265 985.2747 992.6837 1018.9418 1037.7903 1051.3704 1077.7306 1098.3535 1130.4215 1141.7197 1160.0703 1177.1762 1195.3642 1209.4940 1212.9704 1231.2953 1234.6097 1255.1079 1279.7951 1287.6215 1301.1098 1325.9161 1353.9566 1370.9007 1379.2906 1391.7098 1405.0805 1406.4507 1431.5343 1445.4078 1463.2398 1474.9183 1478.5352 1503.5021 1513.5528 1568.3991 1610.0940 1624.8893 1628.8608 1633.1479 2981.4151 3005.9104 3074.3737 3102.8932 3115.3421 3120.9122 3122.5999 3130.5848 3137.3755 3145.4215 3146.1088 3149.9879 3152.4423 3164.7997 3527.9946 3548.1231
redmass: 5.1830 4.6053 4.6731 5.1879 4.4276 3.6258 5.9282 2.1047 3.8787 2.2179 2.4546 2.7329 4.8955 4.1967 3.7342 1.1821 3.2866 2.6915 3.1484 2.1103 2.6125 3.5285 3.4012 4.4127 6.1461 3.4122 3.2760 3.7790 4.7002 3.2880 4.5722 4.1581 4.8477 2.7341 4.5343 1.3100 3.0986 2.2252 2.4975 1.5298 3.1915 4.1561 1.6790 1.8497 2.4919 1.5012 3.3486 1.4096 1.3191 1.8029 1.9101 1.3939 2.6412 2.2708 2.0520 2.8656 2.1996 1.8247 1.5497 1.3138 1.0865 2.0426 1.4238 1.4146 1.8230 2.1106 1.9016 1.5464 1.6539 2.0176 2.2063 1.5367 1.5365 1.2456 3.0521 3.5325 2.6781 3.0463 3.6519 1.3017 1.1464 1.9326 4.0868 3.9286 7.2592 6.1075 6.5219 7.3472 7.2188 1.0364 1.0831 1.0987 1.0990 1.0858 1.0864 1.0859 1.0891 1.0904 1.0990 1.0981 1.0931 1.0917 1.1000 1.0652 1.0658
irintensity: 0.2875 1.2841 0.6514 1.7064 0.8272 1.9948 2.7204 1.8579 1.7441 1.7717 2.1383 4.8538 4.3934 0.8944 6.5879 36.0810 3.2987 23.2389 10.4585 50.8393 73.0429 40.1770 34.9445 15.3317 2.7463 2.2433 0.7528 10.3875 2.7898 5.0110 11.3395 2.6548 1.7675 6.5054 6.0586 51.7682 11.2593 7.6338 20.1463 52.8672 27.2549 4.1534 0.9218 32.3774 34.9651 26.2484 34.3225 12.1637 8.6959 63.2677 69.8739 0.8386 16.8306 13.5354 17.6638 33.6476 26.6621 42.7523 5.9788 2.8627 1.0879 49.0588 5.5027 8.9773 1.1182 28.2793 2.8149 3.7517 9.9565 0.6455 28.1601 42.4219 27.2642 26.3079 0.6914 1.0067 2.0783 3.8042 2.3875 2.0202 8.5135 12.9699 6.3159 8.2988 1.9440 4.1301 1.4866 2.5483 14.9516 29.6166 9.4704 34.6486 9.5457 3.9368 0.2569 3.3143 8.4647 1.1838 25.5043 14.8901 45.9393 1.4521 39.0733 16.5431 7.0473
temp: 298.150 k
press: 1.00000 atm
elementType: 8 8 6 6 6 6 6 6 6 6 6 6 6 6 6 6 6 6 6 6 6 1 1 1 1 1 1 1 1 1 1 1 1 1 1 1 1
symmnumber: 1
zpe: 772425.4 jmol-1
zpe.correction: 0.294201 hartree
zpe.thermalcorrener: 0.310897 hartree
zpe.thermalcorrenthalpy: 0.311841 hartree
zpe.thermalcorrgfe: 0.251169 hartree
zpe.sumelectzpe: -882.626203 hartree
zpe.sumelectthermal: -882.609508 hartree
zpe.sumelectthermalent: -882.608564 hartree
zpe.sumelectthermalfe: -882.669236 hartree
dipole: -0.3295 -1.6299 1.7692
dipole: 2.4280
quadrupole: -109.0368 -110.2534 -128.5368
quadrupole: -4.3122 8.7331 -0.5063
quadrupole: 6.9056 5.6890 -12.5945 -4.3122 8.7331 -0.5063
hfenergy: -882.9204046 hartree
pointgroup: C01 [X(C19H16O2)]
dipole: -0.1228295 0.5049068 -0.8015508 debye
polarizability: 397.5867423|3.9258617|210.3792735|-1.5923632|-25.0911571|107.4563902 unknown
InChI: InChI=1S/C19H16O2/c1-19(21)17-11-13-7-6-12-4-2-3-5-15(12)16(13)10-14(17)8-9-18(19)20/h2-11,18,20-21H,1H3
charge 0 multiplicity 1
37 atoms
O  3.566174 -1.913247 0.855472
O  5.507471 0.268528 0.384889
C  3.254501 -0.736922 0.02369
C  1.754095 -0.462212 0.124522
C  4.055768 0.480279 0.572989
C  1.277761 0.868641 -0.151219
C  0.838168 -1.480553 0.375622
C  3.620039 -1.050943 -1.453574
C  -1.065646 0.082591 0.036621
C  -0.571819 -1.2375 0.348972
C  3.56838 1.793736 -0.003649
C  -0.107318 1.110895 -0.203938
C  2.252287 1.958206 -0.328122
C  -2.512427 0.313467 -0.007797
C  -1.50334 -2.305599 0.623045
C  -3.407647 -0.785253 0.270076
C  -2.868156 -2.088533 0.58522
C  -3.088037 1.584969 -0.315594
C  -4.821238 -0.574955 0.231701
C  -4.477138 1.769877 -0.348325
C  -5.355115 0.682293 -0.072303
H  3.948107 0.479342 1.675677
H  1.210626 -2.483721 0.606978
H  3.017299 -1.908103 -1.795098
H  3.415802 -0.191949 -2.117788
H  4.686344 -1.331539 -1.544193
H  4.288586 2.619074 -0.058289
H  -0.441841 2.132145 -0.416337
H  1.883275 2.930125 -0.678464
H  4.556516 -1.956955 0.923217
H  -1.102469 -3.297279 0.862137
H  -3.568355 -2.905926 0.794163
H  5.729175 0.433634 -0.567548
H  -2.440976 2.440296 -0.53352
H  -5.48517 -1.420992 0.446191
H  -4.890181 2.756068 -0.587162
H  -6.439699 0.833017 -0.098659
