program: Gaussian 09
title: 000190188
version: EM64L-G09RevD.01
frameworkgroup: C1[X(C19H18)]
method: RPBEPBE
basis: SDD
operation: Freq
keyword: #p
keyword: freq=noraman
keyword: PBEPBE/SDD
title: #p freq=noraman PBEPBE/SDD
converged: YES YES NO YES
title: Mulliken charges:
elementType: C C C C C C C C C C C C C C C C C C C H H H H H H H H H H H H H H H H H H
charge: -0.208335 -0.430669 0.335066 0.097408 -0.454054 -0.515779 0.218286 -0.733807 -0.436571 0.476649 -0.513376 -0.646246 -0.706425 0.413535 0.400811 -0.437615 -0.424395 -0.247112 -0.245055 0.219055 0.207732 0.199592 0.209288 0.208149 0.223302 0.220193 0.216246 0.225709 0.226692 0.234417 0.239313 0.249382 0.244963 0.240581 0.239957 0.226464 0.226652
chargesum: 0.00000
title: Mulliken charges with hydrogens summed into heavy atoms:
elementType: C C C C C C C C C C C C C C C C C C C
charge: 0.010720 -0.023345 0.335066 0.097408 -0.036618 -0.072284 0.218286 -0.065160 -0.202153 0.476649 -0.274063 -0.396865 -0.461462 0.413535 0.400811 -0.197034 -0.184439 -0.020648 -0.018404
polarizability: 3.61702568e+02 -1.99051717e+01 2.09366466e+02 4.87132735e+00 -1.90970177e+00 1.01215389e+02
1716.lowfreq: -0.0008 -0.0005 0.0003 4.3702 9.0746 15.5464 52.7167 67.2141 107.9429
frequency: 52.6761 67.1865 107.9287 120.7196 152.8534 189.5229 216.5253 237.7823 266.3541 267.6540 286.7402 320.5274 379.8720 390.5387 409.3906 427.6248 457.9386 471.6897 497.2455 527.6219 539.7364 553.8854 600.7557 611.0765 620.7646 655.9938 702.5496 748.2670 753.3445 768.2991 782.0713 793.3399 818.7354 834.6230 850.7780 863.6783 866.3527 894.3408 903.1841 916.3895 929.9587 955.4232 965.1427 971.1854 980.3234 988.4016 1012.5688 1014.9071 1040.6917 1100.1907 1105.9930 1117.9979 1133.3340 1161.2901 1169.7501 1176.3887 1190.3254 1200.4792 1206.3874 1224.1555 1261.2180 1274.7470 1284.9422 1293.9829 1300.1651 1319.8063 1332.6794 1344.2098 1358.3367 1364.8575 1387.1457 1402.4909 1416.6400 1432.2307 1438.6322 1451.8015 1462.2990 1465.7141 1473.6226 1474.7606 1480.9987 1487.5637 1553.8134 1566.2996 1589.3715 1628.4538 1636.4417 2949.1806 2956.5052 2976.4918 2980.9102 2986.3761 3010.1650 3034.9139 3046.7637 3072.0224 3080.8609 3108.1996 3114.2334 3116.8854 3122.0394 3136.6072 3139.1363 3140.8601 3160.2138
redmass: 3.7726 3.2677 3.1008 3.8417 3.9400 2.0316 1.3073 3.2733 2.8363 3.3271 4.3021 3.0376 3.2782 3.2931 3.4723 2.9792 4.0057 2.4700 4.3018 3.5677 3.4623 4.5410 3.4896 3.2911 5.7786 3.1177 5.5736 3.4885 1.2658 3.5184 4.0493 2.2495 1.4108 2.8078 1.4310 1.7157 2.5098 2.3868 1.8335 3.0567 2.0010 2.2313 1.3900 1.4970 1.5891 1.3469 1.7699 2.1927 2.1434 1.8954 1.7969 1.7491 1.6351 1.5537 1.1080 1.4277 1.3713 1.5588 1.7871 1.5057 1.2597 2.0533 1.6815 2.2041 1.3931 2.3501 1.4845 1.4828 1.5575 2.0577 1.2145 4.6528 2.1258 4.2477 6.9112 1.4335 1.1395 1.7094 1.1110 1.1004 1.8163 1.3217 5.4324 7.9571 5.5780 6.9046 6.6437 1.0643 1.0790 1.0401 1.0599 1.0660 1.0913 1.0990 1.1033 1.0994 1.0992 1.0860 1.0910 1.0859 1.0886 1.0974 1.0906 1.0943 1.1003
irintensity: 0.4198 0.0802 0.0437 0.8786 0.3233 1.5756 0.4658 0.1917 0.2016 0.2319 2.0610 0.9595 1.9948 0.4127 0.1552 0.2526 1.3346 20.2475 0.0753 0.4828 1.3714 0.8739 1.8186 0.8121 3.2465 7.3139 2.6949 1.7323 67.6684 0.6928 2.0698 0.4337 4.9346 0.2067 3.8811 3.7658 3.3921 24.7942 44.1114 3.5562 3.2192 2.8309 4.6417 7.7625 1.6026 0.0775 17.1253 1.6748 10.3397 0.2108 0.4396 7.4721 6.8525 4.1675 1.0052 2.2347 2.9354 7.1889 2.2788 1.0395 1.8961 3.8940 1.3873 3.3067 2.2103 3.3333 0.4088 2.9490 2.5957 1.1536 14.8404 7.9195 3.5038 3.3102 1.9047 1.4656 4.0519 18.0092 12.0781 10.4371 6.3907 7.1436 5.6856 1.5338 1.8135 15.4895 1.6227 21.8581 14.9958 40.3926 61.4910 37.9270 29.0590 68.0011 60.0858 58.5147 31.4779 8.4343 8.0624 6.0013 0.7498 35.0883 0.6975 42.8857 48.1909
temp: 298.150 k
press: 1.00000 atm
elementType: 6 6 6 6 6 6 6 6 6 6 6 6 6 6 6 6 6 6 6 1 1 1 1 1 1 1 1 1 1 1 1 1 1 1 1 1 1
symmnumber: 1
zpe: 814579.4 jmol-1
zpe.correction: 0.310257 hartree
zpe.thermalcorrener: 0.325100 hartree
zpe.thermalcorrenthalpy: 0.326044 hartree
zpe.thermalcorrgfe: 0.269065 hartree
zpe.sumelectzpe: -733.529914 hartree
zpe.sumelectthermal: -733.515071 hartree
zpe.sumelectthermalent: -733.514127 hartree
zpe.sumelectthermalfe: -733.571106 hartree
dipole: -0.9929 -0.3599 -0.0806
dipole: 1.0592
quadrupole: -99.2748 -100.5589 -118.6809
quadrupole: 0.6060 0.9622 -0.4639
quadrupole: 6.8968 5.6126 -12.5094 0.6060 0.9622 -0.4639
hfenergy: -733.8401714 hartree
pointgroup: C01 [X(C19H18)]
dipole: 0.3897439 -0.1442928 0.0305067 debye
polarizability: 362.0570804|18.7725636|209.0935361|2.8169057|0.5629681|101.1338068 unknown
InChI: InChI=1S/C19H18/c1-13-5-4-8-18-17(13)10-9-16-11-14-6-2-3-7-15(14)12-19(16)18/h2-3,6-7,9-13H,4-5,8H2,1H3
charge 0 multiplicity 1
37 atoms
C  3.975022 0.295977 0.218877
C  4.264555 -1.170111 0.62354
C  2.470341 0.579141 0.153833
C  1.504226 -0.434133 0.081465
C  3.402648 -2.147085 -0.201552
C  1.900134 -1.908456 0.062604
C  0.090201 -0.081166 0.050822
C  4.671089 0.676018 -1.120075
C  2.058959 1.963173 0.173389
C  -0.303833 1.325954 0.066834
C  0.72465 2.331806 0.127071
C  -0.937577 -1.058292 0.014999
C  -1.675026 1.675948 0.033844
C  -2.31287 -0.711169 -0.014534
C  -2.695867 0.695477 -0.00843
C  -3.351842 -1.709153 -0.051586
C  -4.095325 1.036714 -0.042128
C  -4.694762 -1.343993 -0.082988
C  -5.071071 0.044863 -0.078548
H  4.399948 0.960917 1.000238
H  4.036126 -1.309245 1.699579
H  5.341333 -1.388229 0.487211
H  3.659773 -3.194632 0.04455
H  3.617841 -2.012423 -1.2794
H  1.619943 -2.365183 1.036009
H  1.308495 -2.445103 -0.70452
H  5.768332 0.568872 -1.030161
H  4.326501 0.030193 -1.947608
H  4.450939 1.721058 -1.40346
H  2.837146 2.734521 0.236668
H  0.432946 3.388503 0.146998
H  -0.679087 -2.122576 0.014893
H  -1.951862 2.738119 0.044086
H  -3.065174 -2.767872 -0.055376
H  -4.37992 2.095976 -0.038006
H  -5.475215 -2.112417 -0.111509
H  -6.132714 0.314509 -0.103933
