program: Gaussian 09
title: 000190185
version: EM64L-G09RevD.01
frameworkgroup: C1[X(C19H16O2)]
method: RPBEPBE
basis: SDD
operation: Freq
keyword: #pfreq=noraman
keyword: PBEPBE/SDD
title: #p freq=noraman PBEPBE/SDD
converged: YES YES NO NO
title: Mulliken charges:
elementType: O O C C C C C C C C C C C C C C C C C C C H H H H H H H H H H H H H H H H
charge: -0.432091 -0.431828 0.091231 -0.273127 0.208003 -0.204809 0.371966 0.498768 -0.651748 0.218911 0.480631 -0.271037 -0.376318 -0.687999 -0.460669 -0.513550 0.326368 -0.478166 -0.444568 -0.239696 -0.831117 0.259897 0.261313 0.269505 0.241592 0.255334 0.236747 0.234630 0.245442 0.250158 0.342790 0.232120 0.341890 0.228139 0.232358 0.232856 0.236075
chargesum: 0.00000
title: Mulliken charges with hydrogens summed into heavy atoms:
elementType: O O C C C C C C C C C C C C C C C C C C C
charge: -0.089301 -0.089938 0.091231 -0.013230 0.208003 0.056504 0.371966 0.498768 -0.382244 0.218911 0.480631 -0.029445 -0.139571 -0.432665 -0.226039 -0.268108 0.326368 -0.228008 -0.212448 -0.011558 -0.129829
polarizability: 3.86668952e+02 -2.68817535e+01 2.34508143e+02 5.12588208e+00 -5.36060339e-01 1.06508055e+02
1716.lowfreq: -11.8330 -6.5744 -0.0006 -0.0005 0.0001 6.2827 40.0062 54.6526 70.5414
frequency: 39.6066 54.6444 70.5110 111.7843 122.6687 152.2841 176.4586 186.1945 201.7820 229.7929 265.9916 271.5834 291.8455 309.6053 316.4148 340.2866 360.3417 395.6251 421.0353 429.6846 458.4429 484.6387 507.1417 524.7870 537.4471 538.8545 557.0485 570.1563 592.5412 626.7098 671.4343 707.2499 731.0411 738.4299 753.8413 770.6029 801.4585 803.3001 833.4872 835.8035 846.4137 871.5755 894.2382 907.1244 921.1897 933.7822 937.3784 943.2660 973.8627 976.9366 983.1934 986.9327 1046.1436 1046.9341 1056.5226 1078.6385 1130.4258 1165.6564 1173.5178 1179.7906 1199.9917 1205.6152 1209.8677 1212.3000 1232.0284 1272.3325 1275.3485 1292.4805 1305.3232 1337.9996 1351.3103 1355.4728 1376.0208 1392.4517 1398.3380 1400.7115 1417.6225 1431.9173 1438.1113 1453.0078 1470.4596 1476.6720 1484.0950 1545.3486 1572.0983 1588.4400 1609.7636 1629.9094 1643.2859 2970.8085 3044.5325 3055.4192 3067.2352 3086.9240 3114.6088 3118.9375 3122.0736 3131.4130 3135.0564 3143.7048 3149.7400 3155.8477 3157.0900 3540.3643 3549.3681
redmass: 4.8690 4.9378 4.8708 4.6370 5.8863 4.2890 1.9267 1.7860 2.8534 3.8640 3.2822 1.8128 1.6063 1.2918 4.1518 4.3183 4.8445 3.6780 3.3065 4.4861 4.5272 4.1673 4.6484 3.9099 4.5231 3.4747 5.3924 3.5846 4.6400 4.6473 4.4569 5.5676 4.7322 5.4067 1.6860 1.4981 2.5808 2.1718 2.7526 1.9914 3.7741 3.7630 1.4214 1.6017 4.0317 1.9594 5.3473 3.5508 1.3609 1.9435 1.3696 1.3603 2.8944 1.5750 2.8146 1.7932 1.8359 1.1330 1.2019 1.1903 1.8194 1.4483 1.7497 1.5371 1.7705 1.7709 1.9522 1.5079 3.2741 1.5744 1.2685 1.2530 2.2065 2.3630 1.3766 2.1581 2.5611 4.2343 7.2787 2.8683 1.0478 2.1330 1.4442 6.7681 6.8958 5.6400 6.3824 6.4022 6.8358 1.0379 1.0972 1.0846 1.0856 1.0978 1.0873 1.0863 1.0862 1.0915 1.0906 1.0978 1.0908 1.0979 1.0991 1.0664 1.0665
irintensity: 0.0671 1.7042 0.8116 0.6699 1.2581 0.3957 0.4535 1.9173 0.3484 3.5524 5.7209 34.1536 45.6531 93.0989 28.9563 6.6223 3.8467 12.0644 4.4344 1.6554 7.8728 0.1197 1.4164 2.2204 2.3279 2.6343 4.8221 0.5496 1.1917 13.0375 9.5557 3.1226 1.2828 4.6344 5.4234 35.5402 0.9279 15.8645 19.8612 5.6046 3.7855 75.8028 16.5049 40.5584 71.9605 16.4143 78.2040 3.3345 4.1243 4.1356 4.3078 0.6510 2.5987 5.8762 3.1777 8.4227 2.0713 7.2766 7.0749 59.3992 3.5900 32.6985 13.2665 9.4679 1.5444 4.6056 0.0109 0.9380 4.8379 2.1965 28.9205 40.1608 6.2174 8.3113 17.7781 5.2670 1.5882 0.8330 6.7128 2.2984 14.3927 14.0479 11.4014 9.0570 4.2901 0.2608 4.9839 4.6553 3.1493 35.2482 20.1228 8.5270 12.1712 23.3953 11.8778 3.2638 6.5357 15.1486 10.0971 33.7842 1.7876 29.0630 38.4693 12.6324 8.7488
temp: 298.150 k
press: 1.00000 atm
elementType: 8 8 6 6 6 6 6 6 6 6 6 6 6 6 6 6 6 6 6 6 6 1 1 1 1 1 1 1 1 1 1 1 1 1 1 1 1
symmnumber: 1
zpe: 771397.1 jmol-1
zpe.correction: 0.293810 hartree
zpe.thermalcorrener: 0.311101 hartree
zpe.thermalcorrenthalpy: 0.312045 hartree
zpe.thermalcorrgfe: 0.249492 hartree
zpe.sumelectzpe: -882.615197 hartree
zpe.sumelectthermal: -882.597905 hartree
zpe.sumelectthermalent: -882.596961 hartree
zpe.sumelectthermalfe: -882.659514 hartree
dipole: 1.2522 3.5819 -0.3633
dipole: 3.8118
quadrupole: -108.3275 -116.3907 -127.5827
quadrupole: -9.7218 4.8359 0.7976
quadrupole: 9.1061 1.0430 -10.1491 -9.7218 4.8359 0.7976
hfenergy: -882.9090062 hartree
pointgroup: C01 [X(C19H16O2)]
dipole: -0.426625 1.429155 0.1568412 debye
polarizability: 388.8563739|19.7257698|232.3425406|4.2435032|1.3065826|106.486236 unknown
InChI: InChI=1S/C19H16O2/c1-11-3-2-4-13-10-16-14(9-15(11)13)6-5-12-7-8-17(20)19(21)18(12)16/h2-10,17,19-21H,1H3
charge 0 multiplicity 1
37 atoms
O  2.239624 -1.943432 1.532007
O  3.949751 -1.662209 -1.751404
C  1.672853 -0.016135 0.092282
C  2.358503 -1.371714 0.160064
C  0.228977 0.082453 0.047856
C  3.843632 -1.382851 -0.290051
C  2.460732 1.151087 0.137943
C  -0.392422 1.404003 0.014163
C  -0.618805 -1.05401 0.05599
C  -2.649801 0.381946 -0.054902
C  -2.029863 -0.939995 0.003912
C  4.600424 -0.116572 0.035923
C  3.930091 1.062471 0.201091
C  -1.802953 1.517832 -0.041947
C  1.830482 2.449333 0.127701
C  0.451445 2.571242 0.056253
C  -4.098112 0.489129 -0.114038
C  -2.870527 -2.109966 0.009885
C  -4.860426 -0.680205 -0.109757
C  -4.252466 -1.981325 -0.046698
C  -4.7697 1.848158 -0.177467
H  1.84753 -2.116244 -0.472932
H  4.305926 -2.27085 0.172078
H  -0.182335 -2.055245 0.128404
H  5.694485 -0.160971 0.0547
H  -2.240204 2.522082 -0.070867
H  4.483053 1.996686 0.362592
H  2.465634 3.342195 0.167236
H  -0.019153 3.561322 0.038594
H  -2.400134 -3.0987 0.058878
H  2.442601 -1.22681 2.187162
H  -5.953633 -0.607912 -0.154099
H  3.762456 -0.819439 -2.241242
H  -4.891956 -2.870772 -0.04359
H  -4.52754 2.465094 0.70933
H  -4.448848 2.420861 -1.068728
H  -5.866422 1.742168 -0.222823
