program: Gaussian 09
title: 000190174
version: EM64L-G09RevD.01
frameworkgroup: C1[X(C8H6ClOPS2)]
method: RPBEPBE
basis: SDD
operation: Freq
keyword: #p
keyword: freq=noraman
keyword: PBEPBE/SDD
title: #p freq=noraman PBEPBE/SDD
converged: NO YES NO NO
title: Mulliken charges:
elementType: Cl S S P O C C C C C C C C H H H H H H
charge: -0.182154 0.324390 0.325004 0.910291 -0.572515 -0.503348 -0.503242 -0.116331 -0.116651 -0.114207 -0.114124 -0.495525 -0.495674 0.295972 0.295760 0.257324 0.257331 0.273847 0.273852
chargesum: 0.00000
title: Mulliken charges with hydrogens summed into heavy atoms:
elementType: Cl S S P O C C C C C C C C
charge: -0.182154 0.324390 0.325004 0.910291 -0.572515 -0.503348 -0.503242 0.179641 0.179110 0.143117 0.143206 -0.221678 -0.221822
polarizability: 1.90315722e+02 2.22886480e-01 1.29016780e+02 -6.89383004e-02 -2.03438865e+01 1.34969202e+02
1716.lowfreq: -6.4154 -4.5829 0.0020 0.0032 0.0037 6.3602 19.3764 34.8662 52.5959
frequency: 19.3295 34.8535 52.5919 89.5403 94.9702 158.4579 199.9023 215.5091 240.7071 248.7043 270.8429 353.7689 425.1516 452.8132 496.3387 509.6247 566.5152 577.3795 612.3024 621.6593 689.6172 690.6455 717.7391 719.6624 820.2428 820.7196 854.2279 856.8049 927.7820 928.9350 952.9778 974.4111 1024.7761 1061.9599 1065.2959 1099.7295 1100.8340 1211.6517 1215.3668 1321.6953 1326.2147 1440.4184 1444.6885 1509.6777 1512.1809 3181.7863 3181.9502 3197.1788 3197.3877 3236.9517 3237.0333
redmass: 7.7563 7.3084 7.5259 11.4016 14.3664 6.7543 10.0912 5.9763 15.8736 6.1806 11.0427 17.5370 12.0576 6.4148 10.6349 5.6568 3.2324 3.6429 11.1196 11.0757 7.4606 7.3318 1.1720 1.1717 4.8665 4.7807 1.2556 1.2627 1.3787 1.3844 5.4022 3.7327 7.7088 1.8077 1.7803 1.1992 1.2291 1.4092 1.3933 2.2297 2.2521 7.6703 7.8877 4.9387 5.0045 1.0902 1.0902 1.0978 1.0979 1.1011 1.1011
irintensity: 0.1870 0.8644 1.4741 0.0488 0.3666 3.4177 2.2148 10.2379 7.8584 2.1533 3.3719 4.8016 53.4103 3.1161 141.5075 93.5640 13.6912 33.6320 3.1834 13.0688 4.2867 7.0698 44.9383 171.8833 5.0880 14.4841 2.4209 17.2477 0.0096 2.4368 34.7575 87.7434 35.5667 5.2932 0.0522 3.7586 12.5399 67.5376 16.3151 4.8088 6.3512 18.6776 36.7852 15.6554 2.9917 2.8287 1.6550 3.2171 2.6063 0.1627 0.3342
temp: 298.150 k
press: 1.00000 atm
elementType: 17 16 16 15 8 6 6 6 6 6 6 6 6 1 1 1 1 1 1
symmnumber: 1
zpe: 309602.6 jmol-1
zpe.correction: 0.117921 hartree
zpe.thermalcorrener: 0.131138 hartree
zpe.thermalcorrenthalpy: 0.132083 hartree
zpe.thermalcorrgfe: 0.075106 hartree
zpe.sumelectzpe: -1980.114775 hartree
zpe.sumelectthermal: -1980.101558 hartree
zpe.sumelectthermalent: -1980.100614 hartree
zpe.sumelectthermalfe: -1980.157590 hartree
dipole: 0.0016 -5.1419 -1.7824
dipole: 5.4420
quadrupole: -79.2360 -111.0724 -106.3325
quadrupole: 0.0479 0.0185 -2.6417
quadrupole: 19.6443 -12.1921 -7.4522 0.0479 0.0185 -2.6417
hfenergy: -1980.2326964 hartree
pointgroup: C01 [X(C8H6Cl1O1P1S2)]
dipole: -0.0166701 2.1297964 0.2187059 debye
dipolederiv: -0.45857 0.0204219 0.0116106 0.0101597 -0.5504293 -0.2500575 0.0107078 -0.4521979 -0.6887701 -0.0390069 -0.0556294 -0.1510377 -0.0254634 0.1133388 0.0873909 -0.2445001 0.0435713 -0.1348608 -0.0733338 0.0524951 0.1547286 0.019455 0.1163336 0.087573 0.2492508 0.0467321 -0.1024061 2.4961602 -0.0165581 0.0520214 -0.0104273 1.6869119 0.3660837 0.0517011 0.4964231 1.3007803 -0.7970035 -0.0032555 -0.0094722 -0.0041392 -0.5958074 0.0365413 -0.0093082 0.03966 -0.5906603 -0.8015345 -0.1254985 -0.0139227 -0.0022135 -0.3736035 -0.2301553 -0.0326962 -0.2752613 -0.0115465 -0.7983983 0.1432843 -0.0534644 0.0211225 -0.3793175 -0.2265725 -0.0308328 -0.2613518 -0.0077788 0.1332953 0.2104576 -0.10994 -0.0283568 -0.0528961 -0.0929197 0.1847725 0.0989178 -0.0906666 0.1387514 -0.2136977 0.1320835 0.0346795 -0.0541797 -0.0904498 -0.1671951 0.0799385 -0.0954053 -0.1027238 -0.0313488 0.1075941 -0.0351983 -0.1754673 0.0898532 0.0833451 0.0831287 -0.1599096 -0.0876471 0.0236052 -0.1025764 0.0262632 -0.1719598 0.092436 -0.0777375 0.0834974 -0.1777698 -0.0509568 0.0218845 0.2324542 0.0339726 -0.2053428 -0.0899973 0.204263 -0.1142329 0.1291684 -0.0139594 -0.0163863 -0.2438692 -0.0280555 -0.2077857 -0.0895659 -0.2159677 -0.1120662 0.0950588 0.1595449 -0.0229331 0.0135657 -0.0212638 0.1269072 0.0657805 0.0150516 0.0596842 0.0795814 0.1611904 0.0184914 -0.0072184 0.0161247 0.1287688 0.0666003 -0.0089424 0.0607265 0.0756032 0.0177247 -0.0639393 -0.0850567 -0.0479059 0.1601235 0.0220748 -0.1082233 0.0114045 0.0706319 0.0018404 0.0629431 0.0785197 0.0464659 0.1611765 0.0254905 0.1019659 0.016074 0.085467 0.0592662 -0.094481 -0.0052953 -0.0773124 0.1354123 0.0620696 -0.037886 0.043993 0.1109218 0.0553607 0.0901449 -0.0007248 0.0720929 0.1378167 0.0678241 0.0322314 0.0513589 0.1125611 unknown
polarizability: 190.2027164|0.8101654|120.2565409|2.3040355|-16.8620431|143.8424469 unknown
InChI: InChI=1S/C8H6OPS2.Cl/c9-10(7-3-1-5-11-7)8-4-2-6-12-8;/h1-6H;
charge 0 multiplicity 1
19 atoms
Cl 0.057652 -2.24651 -1.70776
S  1.931187 0.971176 -1.190465
S  -1.888477 0.938736 -1.372069
P  -0.036272 -1.100286 0.28693
O  -0.090475 -2.006157 1.604896
C  1.478575 -0.090333 0.189454
C  -1.544349 -0.10232 0.05399
C  2.437656 -0.068101 1.196998
C  -2.582119 -0.073021 0.979966
C  3.543282 0.805494 0.902402
C  -3.664426 0.790251 0.585074
C  3.42775 1.439335 -0.326248
C  -3.45258 1.409005 -0.638402
H  2.3405 -0.663728 2.107654
H  -2.556564 -0.655725 1.903726
H  4.389979 0.955222 1.575478
H  -4.563761 0.943206 1.185198
H  4.107255 2.144867 -0.802111
H  -4.094712 2.104191 -1.177209
