program: Gaussian 09
title: 000190160
version: EM64L-G09RevD.01
frameworkgroup: C1[X(C10H16N4O3)]
method: RPBEPBE
basis: SDD
operation: Freq
keyword: #p
keyword: freq=noraman
keyword: PBEPBE/SDD
title: #p freq=noraman PBEPBE/SDD
converged: NO YES NO NO
title: Mulliken charges:
elementType: O O O N N N N C C C C C C C C C C H H H H H H H H H H H H H H H H
charge: -0.249510 -0.284344 -0.208295 -0.100367 -0.095472 -0.046070 -0.577537 -0.426183 -0.400508 -0.001029 -0.388552 -0.327337 -0.323646 0.088671 0.060414 0.002182 -0.503245 0.219700 0.203398 0.225827 0.212885 0.210296 0.204795 0.195907 0.208619 0.245886 0.231962 0.230928 0.342134 0.340167 0.233758 0.235986 0.238579
chargesum: 0.00000
title: Mulliken charges with hydrogens summed into heavy atoms:
elementType: O O O N N N N C C C C C C C C C C
charge: -0.249510 -0.284344 -0.208295 -0.100367 -0.095472 -0.046070 0.104764 -0.003085 0.038205 0.209266 0.012150 0.127168 0.139244 0.088671 0.060414 0.002182 0.205078
polarizability: 1.84100800e+02 -1.59162880e+01 1.61871030e+02 7.88874042e+00 -8.41961816e-01 9.81409806e+01
1716.lowfreq: -9.7499 -5.0633 -0.0006 -0.0005 -0.0004 6.4267 15.6455 35.3912 48.4333
frequency: 15.4089 35.3165 48.4084 102.4003 104.4874 136.8809 145.3892 176.0090 189.9163 203.7335 223.1385 228.0557 252.8111 293.9396 314.2979 369.5347 400.2187 414.9712 491.4526 505.0331 519.8895 525.1641 555.2573 562.5049 597.4676 621.0575 655.1672 711.2266 719.5649 766.5415 794.8722 812.0550 847.8129 860.0887 875.3449 894.1464 907.5668 936.4291 958.3019 974.4458 985.7464 1007.6502 1021.0744 1051.2055 1058.3474 1105.5155 1106.8193 1113.2935 1121.1233 1152.6025 1175.7097 1183.2566 1194.0894 1253.6881 1255.5458 1272.1272 1294.5790 1326.1470 1329.9368 1341.8061 1343.1812 1350.2509 1355.1045 1371.6224 1385.4742 1431.7341 1446.7976 1450.9776 1456.4617 1457.9079 1460.9897 1465.4522 1466.7188 1480.9090 1485.6786 1528.6852 1618.0578 2978.9877 2984.1257 2989.4511 2992.7032 2997.8525 3001.4494 3009.7896 3038.5739 3057.9039 3058.5041 3072.8876 3081.7176 3103.9682 3144.3525 3551.1465 3710.3742
redmass: 4.2415 4.6480 4.0852 4.1376 3.5801 3.7489 1.1844 3.7789 5.9122 3.0739 5.1639 4.0310 3.7597 2.5408 2.1391 2.4943 3.1006 3.9444 3.5680 3.3991 2.2940 1.4795 6.9047 1.0550 5.0902 4.7952 3.3733 7.9004 6.6453 4.2067 2.4318 5.1749 2.8140 2.3416 2.5066 8.5400 5.3782 1.7525 4.7977 3.3787 3.0489 2.4473 2.6767 1.9126 3.0510 2.1543 2.3834 1.2538 2.0626 1.5733 1.3497 1.4356 1.3989 2.3909 1.4259 1.2218 1.2555 1.3501 3.7630 1.4484 1.5329 1.5515 1.4187 1.2787 2.6929 1.6384 1.0912 1.0518 1.0909 1.1123 1.0803 2.2240 1.3486 1.1306 3.1351 3.0744 1.8475 1.0594 1.0587 1.0653 1.0738 1.0613 1.0296 1.0719 1.0997 1.1048 1.1021 1.1027 1.1037 1.1045 1.1046 1.0444 1.1059
irintensity: 0.1063 0.3092 0.3141 5.5968 7.4440 3.8777 0.0961 5.5970 5.4775 3.3675 1.2831 6.9093 6.9434 11.8823 1.2141 0.4143 3.5190 13.9994 8.2970 4.1455 53.7768 243.2214 5.0839 5.9809 6.9364 8.6843 8.9828 2.5831 6.6437 17.5735 38.5654 18.1425 18.8945 34.8265 52.0239 3.5686 2.6630 11.3133 35.6998 138.2036 5.3657 19.9303 50.9495 16.4989 13.3775 25.4590 26.4253 0.3345 20.6537 23.8087 10.4997 3.7458 22.8691 40.7913 28.3106 9.0530 24.6432 8.2273 293.7093 7.5220 0.6946 7.3833 2.8283 5.8541 9.6305 44.4201 10.0487 14.8425 18.3880 10.3436 81.0079 246.5709 75.6214 21.4185 171.9279 396.8704 502.9718 39.9384 26.9284 21.3301 22.3310 49.6421 37.5656 75.8877 28.6311 10.8920 55.6694 36.6354 39.7797 27.6884 25.9957 133.1537 54.8116
temp: 298.150 k
press: 1.00000 atm
elementType: 8 8 8 7 7 7 7 6 6 6 6 6 6 6 6 6 6 1 1 1 1 1 1 1 1 1 1 1 1 1 1 1 1
symmnumber: 1
zpe: 702365.6 jmol-1
zpe.correction: 0.267517 hartree
zpe.thermalcorrener: 0.283856 hartree
zpe.thermalcorrenthalpy: 0.284800 hartree
zpe.thermalcorrgfe: 0.222165 hartree
zpe.sumelectzpe: -834.016059 hartree
zpe.sumelectthermal: -833.999720 hartree
zpe.sumelectthermalent: -833.998776 hartree
zpe.sumelectthermalfe: -834.061411 hartree
dipole: 0.0186 -0.2950 0.3222
dipole: 0.4373
quadrupole: -88.5078 -90.7752 -103.1030
quadrupole: -13.7170 -2.6176 -1.7807
quadrupole: 5.6208 3.3535 -8.9743 -13.7170 -2.6176 -1.7807
hfenergy: -834.283576 hartree
pointgroup: C01 [X(C10H16N4O3)]
dipole: -0.0068052 -0.1352743 0.1060817 debye
polarizability: 180.4100632|-19.0533541|164.0720945|6.4894728|8.8184032|99.6306529 unknown
InChI: InChI=1S/C10H16N4O3/c1-15-10-13-7(12-9(11)14-10)6-17-8-4-2-3-5-16-8/h8H,2-6,11H2,1H3
charge 0 multiplicity 1
33 atoms
O  -2.87167 0.059962 -1.383404
O  -1.426918 -1.258263 0.052411
O  2.344365 2.188081 0.547371
N  0.964552 0.432603 -0.221824
N  1.933699 -1.784021 -0.374291
N  3.295335 0.101144 0.399059
N  4.189731 -2.054883 0.209686
C  -3.688792 -0.907825 0.767726
C  -3.410423 0.437434 1.477906
C  -2.788784 -1.073477 -0.466742
C  -3.523586 1.605515 0.468661
C  -2.581631 1.364199 -0.723567
C  -0.41574 -1.457774 -1.002136
C  0.900204 -0.910949 -0.501307
C  2.181703 0.861823 0.228385
C  3.11753 -1.218746 0.075971
C  1.161894 3.065129 0.393384
H  -3.517846 -1.761838 1.446948
H  -4.740654 -0.945582 0.425453
H  -2.389144 0.414782 1.902233
H  -4.118422 0.576412 2.315749
H  -3.083062 -1.934589 -1.099423
H  -4.566412 1.688393 0.103843
H  -3.262339 2.567739 0.951528
H  -2.72795 2.105916 -1.526218
H  -1.521749 1.367421 -0.400499
H  -0.724313 -0.907509 -1.912957
H  -0.298723 -2.534448 -1.221147
H  5.073494 -1.678949 0.545108
H  4.07876 -3.040435 -0.015242
H  1.524632 4.057141 0.697835
H  0.339943 2.723724 1.045077
H  0.815716 3.070268 -0.653677
