program: Gaussian 09
title: 000190146
version: EM64L-G09RevD.01
frameworkgroup: C1[X(C32H24O4)]
method: RPBEPBE
basis: SDD
operation: Freq
keyword: #pfreq=noraman
keyword: PBEPBE/SDD
title: #p freq=noraman PBEPBE/SDD
converged: YES YES NO NO
title: Mulliken charges:
elementType: O O O O C C C C C C C C C C C C C C C C C C C C C C C C C C C C C C C C H H H H H H H H H H H H H H H H H H H H H H H H
charge: -0.304407 -0.296529 -0.255749 -0.251719 -0.063398 -0.162890 -0.500240 0.246276 -0.532970 0.306133 -0.578211 -0.666865 0.253267 0.448630 0.186283 -0.495357 0.422680 -0.480084 0.213701 0.217850 -0.373139 -0.435709 -0.263393 0.206874 -0.249435 0.203090 -0.341373 -0.339903 -0.337194 -0.339604 -0.222519 -0.219880 -0.224434 -0.220169 -0.222270 -0.221364 0.299362 0.258167 0.258915 0.229829 0.240983 0.229221 0.243974 0.243355 0.240104 0.234851 0.228907 0.239211 0.228107 0.228813 0.270066 0.277207 0.270330 0.273518 0.233552 0.232390 0.234636 0.232891 0.232316 0.233319
chargesum: 0.00000
title: Mulliken charges with hydrogens summed into heavy atoms:
elementType: O O O O C C C C C C C C C C C C C C C C C C C C C C C C C C C C C C C C
charge: -0.304407 -0.296529 -0.255749 -0.251719 0.235964 0.095277 -0.011496 0.246276 -0.062766 0.306133 -0.334237 -0.423509 0.253267 0.448630 0.186283 -0.255253 0.422680 -0.245233 0.213701 0.217850 -0.144232 -0.196498 -0.035286 0.206874 -0.020622 0.203090 -0.071307 -0.062697 -0.066864 -0.066086 0.011033 0.012509 0.010202 0.012721 0.010046 0.011955
polarizability: 4.25928995e+02 8.25463015e+00 3.72081785e+02 5.83925854e+01 2.63700045e+01 3.16692325e+02
1716.lowfreq: -4.9448 -4.7834 -0.0004 0.0005 0.0005 2.0468 11.4336 16.8439 23.1219
frequency: 11.4254 16.8279 23.1034 25.3501 28.1758 29.7413 57.9203 61.7268 68.0613 75.7896 94.5685 118.4754 139.6624 153.8536 157.4990 177.2330 181.0862 190.2289 219.1284 232.2647 250.4583 275.0446 297.3589 309.9160 321.2370 327.1636 369.3137 403.4974 404.6988 405.3360 415.5459 426.7656 432.6550 443.0125 445.1826 461.0420 482.4255 494.5736 518.8888 527.6102 542.7508 549.2513 576.3363 593.2517 613.7426 613.9409 635.1736 655.7054 658.3461 676.2376 680.1056 684.3769 701.2657 703.4066 707.8144 718.5682 732.1488 754.9044 758.9188 760.7240 795.7284 796.1472 804.3309 814.3008 829.0510 833.3831 850.8470 864.7530 867.1187 874.8446 883.5192 888.5938 910.5470 915.1668 928.6467 940.2141 955.9114 957.4322 958.0612 981.1441 981.9274 990.0950 990.6573 991.7790 996.7222 998.3345 1001.8370 1009.2845 1009.7147 1016.6797 1020.7675 1037.8611 1044.9186 1052.5789 1060.1419 1086.2070 1088.2035 1094.4162 1103.5863 1148.6006 1162.3585 1173.9511 1174.5300 1177.0883 1179.6090 1182.1205 1184.2443 1194.0198 1212.0565 1229.0184 1233.2793 1235.9719 1245.7133 1271.5912 1278.8965 1291.4915 1296.5562 1302.0517 1315.9907 1316.3369 1324.3628 1344.2520 1347.7904 1360.7402 1383.2697 1389.7520 1390.0684 1397.6039 1404.7889 1430.1143 1438.0665 1438.5356 1448.9861 1450.9113 1460.6281 1467.0875 1477.4205 1477.9261 1506.9692 1522.8384 1571.2138 1583.5469 1584.0170 1609.2473 1610.7916 1611.2697 1617.5525 1619.8205 1626.9753 1634.2010 2980.7764 2982.6037 2998.4443 3038.0514 3061.9343 3073.4043 3109.7385 3117.5790 3121.7280 3129.8413 3131.2295 3133.2091 3142.3923 3142.7393 3143.9830 3148.7749 3154.6939 3155.9027 3159.8845 3166.5561 3166.6498 3167.9110 3177.2105 3180.0462
redmass: 6.2528 6.1153 5.7350 4.9616 5.0350 5.0712 5.6016 6.1140 5.1463 5.4047 4.8383 6.1730 5.2565 5.5566 4.6904 4.8545 4.4350 6.3688 2.7684 5.9904 6.2945 4.2936 6.4261 5.3771 5.2874 4.2073 4.4286 2.8436 2.8660 3.4900 4.4142 4.2043 3.0542 3.8721 4.1706 6.0388 5.9218 4.7757 6.2313 3.4775 6.4746 3.3451 5.1266 3.8083 6.4426 6.4413 6.2562 6.8202 6.1416 5.1056 5.0892 5.2394 1.6030 1.6815 2.7250 5.6814 3.3013 3.5598 1.4729 5.3886 2.1802 2.1824 2.0968 4.4906 1.5307 6.1181 2.8377 1.2487 1.2437 2.5063 2.6958 2.2892 1.6867 2.8594 2.4193 3.2297 1.4186 1.4136 1.3999 3.8774 1.4255 6.1625 6.0661 1.3790 1.3881 1.3851 2.7491 1.3294 1.3269 3.4254 2.7429 2.2536 2.6529 2.4978 3.0183 1.6648 1.8137 1.8067 2.0506 1.7517 1.3758 1.0589 1.0583 1.0889 1.2389 1.1999 1.1276 1.4998 1.4671 1.9773 2.2264 2.2959 3.4678 2.0032 1.5134 2.1028 1.5327 1.5303 1.3220 1.3224 1.4107 1.8257 1.6431 1.3820 3.4438 9.9219 9.9825 3.8978 3.3881 3.1641 2.2441 2.2450 2.1738 1.5194 2.3301 1.1153 2.2769 2.2818 3.6193 4.1860 7.6923 6.8690 6.8375 6.0931 6.2617 6.1636 9.5233 10.1377 6.6761 7.1340 1.0811 1.0623 1.0658 1.0971 1.0873 1.0989 1.0910 1.0861 1.0862 1.0855 1.0856 1.0885 1.0891 1.0983 1.0891 1.0940 1.0939 1.0940 1.0928 1.0977 1.0966 1.0982 1.0983 1.0976
irintensity: 0.0639 0.0544 0.7081 0.2421 0.3360 0.6991 2.0553 1.5133 0.8231 0.8600 0.6409 0.9308 0.7457 0.0579 0.1039 0.3438 1.2189 0.8272 4.5095 6.3095 6.0163 5.5472 4.2807 0.3988 2.1252 7.3181 2.4214 0.1591 0.1490 1.3860 3.9388 4.9831 15.4498 0.4591 0.9700 6.3785 4.7763 3.6023 5.0795 0.4130 2.3311 2.4396 2.7272 9.2032 0.4878 0.5830 3.2255 5.3167 5.0142 6.4180 12.9427 10.5346 91.4285 78.9084 7.2153 1.6004 6.4752 6.3438 47.2006 3.7589 22.2734 18.1339 0.0818 4.4929 38.1360 25.2753 8.9932 0.5680 0.1114 3.1776 16.0568 11.7072 26.9150 7.5260 13.7635 30.7513 4.4117 4.6798 5.8020 28.4848 0.6688 1.5030 0.9103 0.0777 0.3198 0.1553 0.6190 0.2311 0.4493 166.9180 87.8767 12.8683 179.4552 63.1042 294.2230 10.4831 44.7607 1.1422 2.9482 1.3906 1.7475 1.1373 0.5494 5.8480 67.2012 25.3597 35.5855 1.6980 39.0857 8.4305 198.0585 66.0392 466.2294 13.7888 4.0376 12.6210 14.1877 5.9112 2.6550 1.6858 11.8095 13.0545 5.0910 4.2847 4.2241 1.8739 3.1299 4.0498 0.0710 4.3028 17.0949 17.4907 6.8293 4.1801 11.0113 28.3292 6.0708 7.8051 19.3547 9.0248 0.5269 14.4842 60.4611 6.3192 10.6168 14.0765 27.7834 278.1703 0.1508 13.7741 14.9196 21.5373 20.8076 29.2841 9.4972 23.1567 16.0161 2.7556 3.6877 0.3760 0.4328 5.0428 10.7584 35.6999 9.8770 30.3366 13.5991 14.4454 12.7872 26.1322 25.4871 22.7923 7.4882 6.9973
temp: 298.150 k
press: 1.00000 atm
elementType: 8 8 8 8 6 6 6 6 6 6 6 6 6 6 6 6 6 6 6 6 6 6 6 6 6 6 6 6 6 6 6 6 6 6 6 6 1 1 1 1 1 1 1 1 1 1 1 1 1 1 1 1 1 1 1 1 1 1 1 1
symmnumber: 1
zpe: 1230585.2 jmol-1
zpe.correction: 0.468705 hartree
zpe.thermalcorrener: 0.497534 hartree
zpe.thermalcorrenthalpy: 0.498478 hartree
zpe.thermalcorrgfe: 0.404950 hartree
zpe.sumelectzpe: -1532.297781 hartree
zpe.sumelectthermal: -1532.268952 hartree
zpe.sumelectthermalent: -1532.268008 hartree
zpe.sumelectthermalfe: -1532.361535 hartree
dipole: 1.1672 -0.3547 3.4046
dipole: 3.6166
quadrupole: -201.7411 -180.3191 -200.3450
quadrupole: -2.9160 -8.2525 7.4333
quadrupole: -7.6060 13.8159 -6.2099 -2.9160 -8.2525 7.4333
hfenergy: -1532.7664857 hartree
pointgroup: C01 [X(C32H24O4)]
dipole: 0.4989087 0.2040204 -1.3168311 debye
polarizability: 425.1153953|-10.3838684|368.3259863|-53.730926|38.1766394|321.2617222 unknown
InChI: InChI=1S/C32H24O4/c33-31(22-10-3-1-4-11-22)35-29-18-17-25-19-24-16-15-21-9-7-8-14-26(21)27(24)20-28(25)30(29)36-32(34)23-12-5-2-6-13-23/h1-16,19-20,29-30H,17-18H2
charge 0 multiplicity 1
60 atoms
O  -1.99238 1.414501 0.753324
O  -0.830075 -1.14918 0.806123
O  -4.11393 1.891065 1.602014
O  -1.802303 -2.428768 2.502545
C  -1.602545 0.845456 2.075748
C  -0.44572 -0.129551 1.821784
C  -1.122217 1.97251 3.00761
C  0.841963 0.544423 1.369349
C  0.005125 2.790147 2.338607
C  1.075279 1.926092 1.678016
C  1.82726 -0.207063 0.710805
C  2.309975 2.484887 1.317887
C  3.079883 0.351601 0.327688
C  3.322157 1.736352 0.649662
C  4.119515 -0.416366 -0.36467
C  4.58322 2.347817 0.291716
C  5.362852 0.233965 -0.703431
C  5.563656 1.624951 -0.358854
C  -3.299726 1.901489 0.644497
C  -1.535978 -2.264299 1.284982
C  3.961787 -1.790721 -0.722771
C  6.387013 -0.501581 -1.376266
C  4.978951 -2.494507 -1.38298
C  -3.583701 2.420514 -0.724671
C  6.204168 -1.847679 -1.714151
C  -1.906939 -3.197976 0.184989
C  -4.867661 2.970617 -0.975771
C  -2.614341 2.376514 -1.76099
C  -2.574361 -4.402425 0.529928
C  -1.620979 -2.908293 -1.17515
C  -5.18053 3.474232 -2.254663
C  -2.932725 2.883001 -3.03875
C  -2.949167 -5.313144 -0.47826
C  -1.999475 -3.823168 -2.179926
C  -4.213437 3.432051 -3.287895
C  -2.662096 -5.025344 -1.834514
H  -2.475786 0.319539 2.498146
H  -0.28638 -0.672856 2.776235
H  -1.975775 2.620771 3.269751
H  -0.760707 1.508793 3.946598
H  -0.444218 3.439964 1.561726
H  0.470266 3.46584 3.080279
H  1.600288 -1.252029 0.483215
H  2.508683 3.539492 1.549917
H  4.74453 3.401408 0.548859
H  6.517467 2.094419 -0.62746
H  3.03221 -2.315234 -0.481349
H  7.325434 0.008604 -1.624867
H  4.830874 -3.547921 -1.644919
H  6.995499 -2.403073 -2.22917
H  -5.598108 2.991095 -0.160159
H  -1.630193 1.946911 -1.553666
H  -2.788823 -4.600442 1.585343
H  -1.11554 -1.972133 -1.427545
H  -6.171862 3.897951 -2.448009
H  -2.185936 2.85035 -3.839455
H  -3.464304 -6.24215 -0.211697
H  -1.782391 -3.599959 -3.230033
H  -4.456853 3.82433 -4.281803
H  -2.955993 -5.73289 -2.6180
