program: Gaussian 09
title: 000190135
version: EM64L-G09RevD.01
frameworkgroup: C1[X(C15H15Cl)]
method: RPBEPBE
basis: SDD
operation: Freq
keyword: #p
keyword: freq=noraman
keyword: PBEPBE/SDD
title: #p freq=noraman PBEPBE/SDD
converged: YES YES NO NO
title: Mulliken charges:
elementType: Cl C C C C C C C C C C C C C C C H H H H H H H H H H H H H H H
charge: -0.075538 -0.360024 -0.388437 0.457202 0.490762 -0.609259 -0.413832 -0.443924 -0.411871 -0.379833 -0.229323 -0.226513 -0.250046 -0.231254 -0.242659 -0.243815 0.203020 0.230727 0.249672 0.290622 0.259579 0.234533 0.229946 0.243772 0.252400 0.226759 0.225437 0.227936 0.224799 0.230328 0.228833
chargesum: 0.00000
title: Mulliken charges with hydrogens summed into heavy atoms:
elementType: Cl C C C C C C C C C C C C C C C
charge: -0.075538 -0.157004 0.091962 0.457202 0.490762 -0.059057 -0.179299 -0.213979 -0.168099 -0.127433 -0.002565 -0.001075 -0.022110 -0.006455 -0.012331 -0.014982
polarizability: 1.78312176e+02 -1.69871207e+01 1.70079230e+02 1.02960599e+01 -7.33288558e+00 1.38888507e+02
1716.lowfreq: -9.7206 0.0004 0.0010 0.0010 3.2512 6.7148 20.8684 34.8788 49.6592
frequency: 20.3612 34.7511 49.6367 58.7786 71.7630 117.3805 188.8765 220.4579 231.4416 238.1263 280.6541 292.0859 402.4826 403.6756 443.7183 476.3775 550.4952 579.4694 612.6861 616.5398 626.9942 680.0225 704.7959 707.1604 742.1537 763.1780 774.2385 813.4072 846.3096 852.3746 857.5251 918.1209 928.4586 975.9451 980.2032 984.1895 990.2808 992.6645 994.6220 997.2417 1020.7318 1027.4252 1035.0608 1066.5839 1081.3785 1084.2635 1131.2528 1171.6592 1173.6031 1184.5148 1189.0406 1193.4111 1204.1378 1235.5156 1266.9440 1276.0965 1310.0481 1327.0990 1338.0302 1348.3320 1379.1452 1386.5031 1437.9199 1441.9090 1462.4083 1479.7428 1482.3618 1489.6079 1591.0314 1593.1928 1609.4313 1614.3514 2968.5525 3014.2675 3054.3603 3068.7602 3109.4523 3116.3082 3120.1596 3123.8151 3134.1724 3135.4932 3140.0055 3145.0994 3146.1546 3162.6261 3163.4216
redmass: 3.8559 4.0084 7.0637 5.7429 4.8069 2.3592 4.5001 6.3874 3.6625 3.6073 4.3864 3.9365 2.8146 2.8320 4.1770 3.5946 3.0772 4.7719 5.2060 6.3969 4.4364 5.9632 1.7136 1.7921 2.1792 1.7816 1.7521 1.7956 3.1978 1.2522 1.2687 1.4449 1.4654 1.3920 1.4066 2.1951 5.8440 3.6996 1.3642 1.3199 2.6555 2.1872 2.3359 3.3729 1.6480 1.4475 1.2489 1.0749 1.0575 2.4390 1.1516 1.1185 2.3033 1.2382 1.3003 1.2815 1.3671 1.2551 1.3274 1.3970 7.5671 5.5706 2.2063 2.1180 1.0974 2.0409 1.8526 1.2884 6.0426 5.9245 6.0652 6.0716 1.0829 1.0605 1.0589 1.1008 1.0878 1.0870 1.0862 1.0856 1.0908 1.0910 1.1097 1.0958 1.0957 1.1014 1.1014
irintensity: 0.0856 0.0341 1.0856 0.6217 0.1496 1.3427 3.4062 0.2561 1.0388 0.7266 0.5762 2.1489 0.2723 0.0045 1.1437 4.5839 40.8673 6.3393 9.9771 0.2492 5.4444 26.1063 60.1912 50.4000 24.0934 26.2171 28.6957 6.5061 6.0135 0.1578 0.0692 1.3310 3.1737 0.0754 0.1198 3.1938 0.4997 3.2250 0.0940 0.5589 0.7879 13.4199 2.9567 10.1759 3.5261 12.4470 1.9244 0.1017 0.0791 0.0605 1.3408 0.2890 1.5384 4.2079 1.6767 10.6824 3.3861 10.4746 8.0061 1.2104 0.5907 0.8040 13.2066 4.4067 4.2349 15.4819 35.4164 5.7597 3.0677 0.1414 15.7856 3.7659 16.8777 10.8925 22.1224 13.0186 10.3889 7.2665 4.5901 0.1943 10.5896 14.6258 13.4855 27.4618 47.6428 32.2048 19.1399
temp: 298.150 k
press: 1.00000 atm
elementType: 17 6 6 6 6 6 6 6 6 6 6 6 6 6 6 6 1 1 1 1 1 1 1 1 1 1 1 1 1 1 1
symmnumber: 1
zpe: 665452.8 jmol-1
zpe.correction: 0.253458 hartree
zpe.thermalcorrener: 0.267838 hartree
zpe.thermalcorrenthalpy: 0.268782 hartree
zpe.thermalcorrgfe: 0.209200 hartree
zpe.sumelectzpe: -1039.517003 hartree
zpe.sumelectthermal: -1039.502622 hartree
zpe.sumelectthermalent: -1039.501678 hartree
zpe.sumelectthermalfe: -1039.561261 hartree
dipole: 1.4608 2.0502 0.8591
dipole: 2.6599
quadrupole: -103.9033 -105.4580 -94.4015
quadrupole: -10.9717 0.2712 -4.4750
quadrupole: -2.6491 -4.2037 6.8528 -10.9717 0.2712 -4.4750
hfenergy: -1039.7704604 hartree
pointgroup: C01 [X(C15H15Cl1)]
dipole: 0.2028983 0.9566658 0.3725242 debye
polarizability: 189.1640931|-9.0034844|159.1398475|12.5614008|-2.0383156|138.9759716 unknown
InChI: InChI=1S/C15H15Cl/c16-12-11-15(13-7-3-1-4-8-13)14-9-5-2-6-10-14/h1-10,15H,11-12H2
charge 0 multiplicity 1
31 atoms
Cl -1.6580 -4.452649 -0.479014
C  -0.020556 -0.671287 0.577173
C  -0.225172 -2.055483 -0.118478
C  -1.131624 0.350689 0.29879
C  1.37847 -0.136025 0.21645
C  -1.494939 -2.760449 0.360465
C  -1.391695 1.356629 1.265637
C  2.488546 -0.476867 1.031114
C  -1.885737 0.365509 -0.902572
C  1.603695 0.646145 -0.944132
C  -2.373023 2.346795 1.0447
C  3.793514 -0.052848 0.695088
C  -2.87114 1.354268 -1.12899
C  2.907827 1.070573 -1.284424
C  -3.118886 2.349652 -0.15741
C  4.008408 0.722147 -0.467802
H  -0.016805 -0.861854 1.670998
H  -0.249431 -1.934513 -1.216931
H  0.651165 -2.690514 0.104624
H  -2.415676 -2.220374 0.098632
H  -1.473892 -2.977324 1.440005
H  -0.812028 1.365176 2.197412
H  2.329361 -1.077038 1.936637
H  -1.71265 -0.396759 -1.67158
H  0.755578 0.940303 -1.572408
H  -2.557125 3.112771 1.80652
H  4.638395 -0.322702 1.338934
H  -3.444413 1.345118 -2.063034
H  3.064591 1.677121 -2.183774
H  -3.883328 3.114868 -0.332303
H  5.018773 1.054724 -0.730824
