program: Gaussian 09
title: 000190121
version: EM64L-G09RevD.01
frameworkgroup: C1[X(C10H12O6S)]
method: RPBEPBE
basis: SDD
operation: Freq
keyword: #p
keyword: freq=noraman
keyword: PBEPBE/SDD
title: #p freq=noraman PBEPBE/SDD
converged: YES YES NO NO
title: Mulliken charges:
elementType: S O O O O O O C C C C C C C C C C H H H H H H H H H H H H
charge: 1.088178 -0.319867 -0.419979 -0.290650 -0.575541 -0.483272 -0.520286 0.311725 -0.311657 0.363184 0.160802 -0.751240 -0.705060 -0.382441 0.113007 -0.194735 -0.292513 0.238949 0.267587 0.245815 0.212417 0.211164 0.248352 0.268804 0.258442 0.350079 0.240101 0.263719 0.404915
chargesum: 0.00000
title: Mulliken charges with hydrogens summed into heavy atoms:
elementType: S O O O O O O C C C C C C C C C C
charge: 1.088178 -0.319867 -0.069900 -0.290650 -0.170625 -0.483272 -0.520286 0.311725 -0.072709 0.363184 0.160802 -0.025420 0.023261 -0.123999 0.113007 0.045366 -0.028794
polarizability: 2.56861638e+02 -3.14192722e+01 1.91359907e+02 -2.60313254e+00 2.31751257e+00 1.05705619e+02
1716.lowfreq: -4.0407 -3.9690 0.0004 0.0017 0.0019 6.6361 28.5185 51.6492 64.8231
frequency: 28.2390 51.5961 64.8065 74.9283 101.9443 110.3362 149.3224 151.5849 193.3050 210.5786 228.1072 238.6225 257.1229 273.7521 294.1406 298.1397 306.8104 323.9870 350.2237 374.3422 384.2545 402.2403 472.9025 501.2249 511.7467 517.7965 532.5669 545.7346 560.8757 586.9587 618.0878 715.9790 728.9117 753.5332 809.0407 818.5863 828.6911 844.4157 920.7190 926.0158 927.0554 944.7826 973.3915 980.0705 999.9608 1027.1958 1044.9415 1113.2990 1160.4217 1172.6969 1194.6305 1208.9379 1217.8854 1248.1477 1254.4329 1278.4777 1293.9380 1357.0902 1387.4553 1391.8127 1408.6975 1430.9530 1434.2336 1454.5698 1461.1631 1476.1505 1480.3135 1565.0604 1593.9494 2986.9344 2991.3840 2998.2066 3086.6608 3091.1796 3102.9318 3117.5676 3147.9472 3161.9103 3178.5059 3260.8687 3550.7657
redmass: 7.3469 6.0967 5.7288 7.1887 11.6399 5.5814 5.7244 7.6039 4.0141 1.0398 3.4694 2.2650 1.5617 6.3043 5.5843 12.0856 2.2752 1.2336 4.8566 4.1607 5.3160 9.6274 4.4005 1.8903 3.1519 3.5961 3.5761 3.7347 4.8115 5.0795 6.6394 5.6793 3.1703 3.0377 2.3581 13.8003 3.2995 6.0684 1.5824 7.5057 2.0050 1.5827 2.2851 1.5689 1.7936 2.7109 2.0881 1.8027 1.3431 1.3898 1.4996 1.1742 2.6020 1.9754 3.3210 3.2300 1.9842 1.3953 4.1225 1.3737 1.2125 4.1978 2.6237 1.0541 1.0475 1.0590 1.0531 7.2400 6.7410 1.0784 1.0422 1.0387 1.0982 1.0988 1.1000 1.1008 1.0874 1.0926 1.0992 1.0673 1.0663
irintensity: 1.1825 0.7957 0.3406 0.3619 21.1757 1.5021 0.5419 9.3124 1.9061 1.4032 9.1360 1.5072 9.6137 3.8417 16.5364 4.2921 34.1929 102.4103 10.0973 20.0557 20.4864 20.9317 8.1786 57.3252 27.0445 3.2228 15.2911 108.3669 18.8928 7.0839 21.4355 40.9182 29.5974 22.2094 26.6253 121.0900 9.6529 52.5063 3.0754 61.0975 4.2288 5.3217 40.5549 7.1076 1.1543 86.7698 27.0804 65.5564 10.0674 28.3049 64.1402 48.7511 14.1560 20.2986 29.7402 35.6419 49.6354 8.8019 25.4968 21.4583 13.7622 113.5095 7.8298 2.4027 4.3770 15.4930 17.7344 71.0529 40.7976 16.6258 16.7107 18.6119 2.3663 25.9747 9.7219 7.0443 2.9639 3.4255 13.6371 48.0330 6.1476
temp: 298.150 k
press: 1.00000 atm
elementType: 16 8 8 8 8 8 8 6 6 6 6 6 6 6 6 6 6 1 1 1 1 1 1 1 1 1 1 1 1
symmnumber: 1
zpe: 545609.3 jmol-1
zpe.correction: 0.207812 hartree
zpe.thermalcorrener: 0.225710 hartree
zpe.thermalcorrenthalpy: 0.226655 hartree
zpe.thermalcorrgfe: 0.162111 hartree
zpe.sumelectzpe: -1236.189749 hartree
zpe.sumelectthermal: -1236.171850 hartree
zpe.sumelectthermalent: -1236.170906 hartree
zpe.sumelectthermalfe: -1236.235449 hartree
dipole: -9.5794 0.3255 1.7815
dipole: 9.7491
quadrupole: -116.9166 -91.4667 -112.2179
quadrupole: 13.1443 -7.0745 1.3021
quadrupole: -10.0496 15.4004 -5.3508 13.1443 -7.0745 1.3021
hfenergy: -1236.3975603 hartree
pointgroup: C01 [X(C10H12O6S1)]
dipole: 3.7467142 0.6662383 -0.4795765 debye
polarizability: 246.3620076|39.5246574|201.623678|6.0818365|-0.50541|105.9414789 unknown
InChI: InChI=1S/C10H11O3.HO3S/c1-10(2)9(12)6-4-3-5-7(11)8(6)13-10;1-4(2)3/h3-5,9,12H,1-2H3;1H
charge 0 multiplicity 1
29 atoms
S  -2.869171 -0.84936 -0.321345
O  0.396436 -0.893962 0.65672
O  3.528283 0.305922 0.672848
O  -2.012935 0.612041 1.181426
O  -2.095984 -2.300381 0.494717
O  -4.431078 -1.228429 -0.452092
O  -2.01131 -0.507932 -1.668201
C  1.707297 -1.371668 -0.02715
C  2.490245 -0.026363 -0.313764
C  1.407048 1.027383 -0.207741
C  0.263846 0.45329 0.377943
C  2.384383 -2.309906 0.967282
C  1.261062 -2.046143 -1.333709
C  1.407693 2.38944 -0.540385
C  -0.949092 1.19536 0.622973
C  0.22665 3.165782 -0.311477
C  -0.928046 2.58168 0.226932
H  2.936043 -0.08056 -1.327763
H  2.652092 -1.775111 1.892318
H  1.712588 -3.148365 1.217004
H  3.302044 -2.739258 0.524078
H  2.145857 -2.397658 -1.895509
H  0.616854 -2.915955 -1.12261
H  0.686658 -1.349363 -1.969268
H  2.29934 2.856435 -0.971197
H  4.317503 -0.278202 0.533432
H  0.224954 4.22787 -0.575177
H  -1.843204 3.16149 0.384709
H  -1.189757 -1.956276 0.788105
