program: Gaussian 09
title: 000190120
version: EM64L-G09RevD.01
frameworkgroup: C1[X(C16H20O9)]
method: RPBEPBE
basis: SDD
operation: Freq
keyword: #pfreq=noraman
keyword: PBEPBE/SDD
title: #p freq=noraman PBEPBE/SDD
converged: YES YES NO NO
title: Mulliken charges:
elementType: O O O O O O O O O C C C C C C C C C C C C C C C C H H H H H H H H H H H H H H H H H H H H
charge: -0.236803 -0.357026 -0.274517 -0.464607 -0.496008 -0.458549 -0.419628 -0.407699 -0.208104 -0.135622 0.334667 -0.135033 -0.114150 -0.049640 -0.317668 -0.101333 0.335703 0.103295 0.222087 -0.760662 -0.716065 -0.407884 0.178731 -0.349765 -0.208605 0.220538 0.251746 0.261094 0.207524 0.228978 0.247847 0.269228 0.239718 0.205066 0.213559 0.248807 0.237991 0.251901 0.265999 0.368588 0.399407 0.367548 0.231869 0.344352 0.383124
chargesum: 0.00000
title: Mulliken charges with hydrogens summed into heavy atoms:
elementType: O O O O O O O O O C C C C C C C C C C C C C C C C
charge: -0.236803 -0.357026 -0.274517 -0.096019 -0.096601 -0.091001 -0.075276 -0.024574 -0.208104 0.084915 0.334667 0.116713 0.146944 0.157884 -0.088690 0.146514 0.335703 0.103295 0.222087 -0.046650 -0.015708 -0.155983 0.178731 -0.083766 0.023264
polarizability: 2.55525731e+02 9.73345692e+00 2.19133883e+02 -9.13084596e+00 7.79149836e+00 1.36988677e+02
1716.lowfreq: -8.3397 -3.3825 0.0002 0.0007 0.0011 4.1264 15.6812 29.4949 39.9668
frequency: 15.1007 29.4692 39.9417 42.1533 59.8987 70.6340 86.4897 98.1729 106.7732 135.2333 156.5912 180.9564 203.3082 215.1701 226.3164 237.1598 243.3365 253.6495 260.6008 266.8305 287.6432 303.7514 312.1841 317.7320 326.3472 362.8894 370.5004 380.5345 400.2073 408.2575 426.4416 448.7233 464.7510 483.4785 514.0959 526.7811 529.0663 540.3359 542.6983 560.2495 590.3478 611.3590 617.1068 629.7044 641.2899 651.6782 714.8162 728.1611 743.5739 757.9851 796.8992 825.1211 848.2691 893.6030 912.1239 914.9593 928.3085 933.3026 939.3637 964.6673 967.9496 972.1146 983.7460 1001.4070 1019.3838 1029.4349 1033.7445 1045.6319 1051.2615 1072.3912 1076.1587 1084.3700 1098.0687 1112.9802 1162.9450 1170.0938 1177.2877 1181.8557 1215.9790 1219.7283 1227.9683 1228.8614 1241.8847 1250.9720 1254.1630 1256.9519 1278.6231 1301.0834 1304.0984 1310.5455 1328.9558 1351.9011 1356.4892 1360.3101 1383.3705 1385.2090 1394.1563 1396.4767 1399.8363 1411.5495 1447.9980 1456.9748 1460.4915 1467.9590 1475.5177 1480.1622 1607.3941 1620.9455 1679.1829 2935.9493 2956.1354 2974.8892 2986.7632 2994.2547 2997.9252 3003.1325 3018.0155 3080.6354 3086.1913 3099.3040 3116.3362 3144.5147 3159.7059 3175.0097 3321.1850 3510.4878 3543.6411 3559.1800 3561.0800
redmass: 5.6809 7.3994 5.7525 5.6397 4.7045 6.9727 6.8446 6.0366 7.4561 6.2292 5.3288 4.4606 4.0266 1.0930 3.0228 3.2906 2.9832 4.9130 1.7710 3.4024 5.1070 2.2976 3.4271 1.3913 4.6031 4.7428 4.3641 4.1062 1.3063 5.1175 1.2359 3.6946 5.1575 4.1463 5.3397 5.4639 3.6601 4.0046 3.6816 4.2830 4.9141 2.1451 2.6543 5.5389 3.0074 1.1316 4.5407 3.8808 5.3377 3.0609 1.9589 3.7303 4.9414 5.0779 1.4187 4.7077 1.8440 3.7339 2.2336 4.6082 1.7171 2.4677 3.8834 2.4642 2.9876 3.6721 3.9447 2.3943 3.0865 2.4506 2.1717 2.7437 3.7570 2.0855 1.3697 1.4883 1.5546 1.3667 2.2632 1.1917 1.6260 1.3817 1.2428 2.2610 3.3115 1.2882 1.1872 1.7557 1.1934 1.3457 1.2083 1.4161 1.3917 1.5362 1.3398 1.6401 6.3040 1.7210 1.2508 1.4540 3.3409 1.0622 1.0484 3.0161 1.0673 1.0558 7.7939 8.8323 9.2165 1.0842 1.0822 1.0841 1.0369 1.0381 1.0842 1.0843 1.0859 1.0989 1.0977 1.0998 1.1004 1.0869 1.0928 1.0991 1.0690 1.0639 1.0661 1.0656 1.0657
irintensity: 0.2279 0.7413 0.6387 1.7349 1.6793 1.3729 0.0932 8.7597 0.9150 1.9064 5.3840 2.1402 11.1503 2.0859 1.5000 1.3871 0.4219 6.4082 3.1759 22.7139 4.3393 30.1856 55.2183 66.1769 2.2145 8.5307 6.6370 9.6755 117.3501 14.1267 140.3147 20.3344 1.3055 27.4576 7.0521 40.8603 1.9318 10.0589 5.5353 14.0210 35.4933 46.1779 84.6165 4.4517 15.5326 199.6144 66.1777 11.5907 14.3350 36.3696 57.9644 4.2372 65.4771 13.2484 7.7144 90.9755 14.6569 31.4162 84.3464 11.2694 105.5782 244.7431 249.2429 19.8012 13.3018 95.1546 36.1676 27.8547 14.1390 196.9695 12.7087 31.2109 0.4950 100.2917 26.5513 28.1781 97.2219 2.9438 19.0488 23.3808 34.4732 18.2191 35.5437 58.4441 17.5912 2.1393 17.0411 17.9759 13.7687 23.5004 44.6284 13.4574 21.6067 13.3165 34.8254 9.1823 15.5632 48.4136 19.6628 6.6029 74.6526 3.5808 2.2602 68.4113 8.9857 30.0912 28.8089 16.4419 207.5378 18.7153 28.2203 33.6576 13.9420 21.3169 15.8781 6.3754 61.9523 16.1522 25.9565 18.0888 9.9011 2.7915 8.8589 10.4974 519.8077 27.6020 5.5370 15.3070 27.0043
temp: 298.150 k
press: 1.00000 atm
elementType: 8 8 8 8 8 8 8 8 8 6 6 6 6 6 6 6 6 6 6 6 6 6 6 6 6 1 1 1 1 1 1 1 1 1 1 1 1 1 1 1 1 1 1 1 1
symmnumber: 1
zpe: 909748.0 jmol-1
zpe.correction: 0.346505 hartree
zpe.thermalcorrener: 0.371138 hartree
zpe.thermalcorrenthalpy: 0.372083 hartree
zpe.thermalcorrgfe: 0.291538 hartree
zpe.sumelectzpe: -1296.772132 hartree
zpe.sumelectthermal: -1296.747498 hartree
zpe.sumelectthermalent: -1296.746554 hartree
zpe.sumelectthermalfe: -1296.827099 hartree
dipole: -6.6180 -1.1556 4.2447
dipole: 7.9467
quadrupole: -132.4924 -133.0118 -153.6182
quadrupole: 14.8722 -3.4718 5.0816
quadrupole: 7.2151 6.6957 -13.9107 14.8722 -3.4718 5.0816
hfenergy: -1297.1186363 hartree
pointgroup: C01 [X(C16H20O9)]
dipole: -2.6846858 -1.5940379 0.1623836 debye
polarizability: 253.3433743|5.887094|156.8327424|12.0132012|37.6047489|201.4721744 unknown
InChI: InChI=1S/C16H20O9/c1-16(2)13(20)6-4-3-5-7(11(6)25-16)23-15-10(19)8(17)9(18)12(24-15)14(21)22/h3-5,8-10,12-13,15,17-21H,1-2H3
charge 0 multiplicity 1
45 atoms
O  2.327238 1.039625 0.903191
O  -1.999508 0.094949 -1.266137
O  0.224314 1.438297 -0.004442
O  3.328429 -1.615875 -2.23266
O  0.550522 -0.990543 -1.734622
O  5.009047 -1.430758 0.113428
O  -5.242157 0.921072 -0.917644
O  4.60847 0.645909 3.165722
O  5.266226 1.788577 1.250556
C  2.799948 -1.148143 -0.948252
C  -3.308217 -0.683718 -1.481057
C  1.616745 -0.191851 -1.134635
C  3.961999 -0.46462 -0.219291
C  1.194516 0.383442 0.232313
C  -4.302722 -0.08833 -0.401531
C  3.458828 0.104772 1.122049
C  -3.37448 0.603698 0.575188
C  -2.092797 0.691143 0.000729
C  -1.02356 1.327908 0.659734
C  -3.719175 -0.432285 -2.930339
C  -2.983385 -2.154587 -1.172257
C  -3.621319 1.178314 1.835197
C  4.538896 0.942487 1.803736
C  -1.26621 1.904673 1.924454
C  -2.555995 1.828398 2.50828
H  2.452402 -2.01702 -0.34558
H  1.902167 0.661444 -1.784138
H  4.360773 0.358633 -0.845751
H  0.763099 -0.410432 0.884283
H  -4.871987 -0.921434 0.060891
H  3.159583 -0.725855 1.791707
H  -3.908519 0.640022 -3.096935
H  -2.919788 -0.764924 -3.614084
H  -4.63426 -1.00092 -3.180793
H  -3.871771 -2.78878 -1.348046
H  -2.164846 -2.514427 -1.818187
H  -2.671043 -2.278659 -0.119831
H  -4.620573 1.137556 2.280012
H  -0.440216 2.412503 2.43276
H  2.563351 -1.966666 -2.757181
H  -0.312544 -0.478568 -1.750658
H  5.286516 -1.867225 -0.732592
H  -2.728081 2.284903 3.488066
H  -5.93329 0.472747 -1.470272
H  5.316074 1.204152 3.590018
