program: Gaussian 09
title: 000190118
version: EM64L-G09RevD.01
frameworkgroup: C1[X(C16H15Cl3O3)]
method: RPBEPBE
basis: SDD
operation: Freq
keyword: #p
keyword: freq=noraman
keyword: PBEPBE/SDD
title: #p freq=noraman PBEPBE/SDD
converged: YES YES NO NO
title: Mulliken charges:
elementType: Cl Cl Cl O O O C C C C C C C C C C C C C C C C H H H H H H H H H H H H H H H
charge: 0.125008 0.050647 0.099650 -0.294296 -0.377239 -0.274743 0.600917 -0.242541 0.299018 -0.480209 -0.472809 0.168467 -0.333944 -0.579204 -0.493655 0.455447 -0.351826 -0.381642 -0.232527 -0.232206 -0.231739 -0.503125 0.284589 0.236358 0.236392 0.256385 0.204326 0.231956 0.355537 0.241941 0.234375 0.235024 0.230892 0.232771 0.232526 0.244202 0.225274
chargesum: 0.00000
title: Mulliken charges with hydrogens summed into heavy atoms:
elementType: Cl Cl Cl O O O C C C C C C C C C C C C C C C C
charge: 0.125008 0.050647 0.099650 -0.294296 -0.021702 -0.274743 0.600917 0.042049 0.299018 -0.243851 -0.236417 0.168467 -0.077560 -0.579204 -0.057373 0.455447 -0.109884 -0.147267 0.002497 -0.001313 0.001031 0.198879
polarizability: 2.76602592e+02 1.13495551e+00 1.86335063e+02 -1.55475743e+00 1.38351773e-01 1.72947528e+02
1716.lowfreq: -6.3572 -4.3680 -3.1338 0.0018 0.0023 0.0028 15.0966 19.6558 33.1922
frequency: 14.6348 19.2367 33.0858 37.9709 47.5091 62.4061 68.2867 110.8137 121.4649 136.8513 161.5934 166.3472 184.7990 187.8780 215.7144 227.5549 248.0817 252.5048 259.7407 283.1476 299.0916 331.7195 344.6490 371.6405 383.1827 403.1715 422.4630 443.7393 478.0115 494.0016 531.4530 561.6572 573.8088 593.2308 617.2410 630.4092 696.4635 704.9727 707.8305 731.3463 739.8181 757.1831 773.2695 812.3515 822.9090 856.6028 864.3265 875.8941 925.0105 934.2422 943.4981 967.4543 968.9964 978.2982 979.7838 990.4750 1000.2350 1004.2638 1026.3484 1092.7525 1102.8986 1115.1401 1144.7470 1157.0655 1174.4120 1190.4422 1211.1766 1217.2226 1220.1329 1233.1641 1255.5452 1263.5152 1313.5243 1329.2855 1342.6073 1369.2051 1385.2619 1387.1438 1412.5726 1439.7590 1441.0310 1455.1330 1469.1545 1480.1649 1486.1648 1496.3359 1574.4863 1594.0007 1609.8849 1613.5570 2990.5911 3012.8725 3054.8696 3092.9270 3099.6056 3118.2125 3125.2215 3129.8679 3137.5609 3139.8439 3150.8174 3152.9457 3166.6209 3170.6588 3545.6677
redmass: 9.2920 6.1173 5.4557 5.5714 4.6810 4.1967 7.4881 5.0714 3.6720 4.8356 4.3440 5.7254 5.8580 1.4044 1.5895 6.0497 15.7921 5.6624 5.7648 4.7651 12.4571 5.8748 3.0809 10.5443 3.2556 2.8117 5.7905 3.6450 4.0751 4.4759 6.4597 5.5286 5.7215 4.2654 6.3257 4.9232 6.0109 1.9200 4.3519 4.3603 7.3715 2.3410 4.2215 3.4755 1.4670 1.2511 4.2219 1.7373 3.1820 1.7805 1.4021 2.1398 7.8458 3.9525 1.3967 6.2670 1.3248 3.8779 2.2245 1.5214 2.6142 1.2577 1.6282 1.3196 1.0547 1.1251 1.5341 2.3885 1.3578 1.3984 4.2246 1.4034 1.5571 1.2694 1.3131 1.4579 8.1789 3.1183 2.1235 1.3319 2.1635 1.0638 1.0517 1.3183 1.8002 2.6340 7.6703 6.0140 6.4195 6.0567 1.0306 1.0634 1.0851 1.1015 1.1019 1.0875 1.1053 1.0867 1.0895 1.0916 1.0957 1.0900 1.1015 1.0955 1.0662
irintensity: 0.0764 0.0083 0.2334 0.7707 1.1708 2.4769 0.3269 1.6534 8.2783 0.3062 1.9465 11.4314 0.2365 4.8844 91.8016 0.2960 5.5053 25.4103 24.9341 3.1439 5.2537 0.3960 2.9283 2.0836 1.0318 0.0050 4.9819 0.8066 5.8109 28.4498 23.2175 60.8473 69.7639 9.5896 0.7457 21.5916 92.5538 38.2006 37.2247 23.2126 82.4688 76.4678 54.3054 8.3219 41.4698 0.7145 19.5134 21.4615 138.8078 26.6027 4.6766 34.2693 12.3542 47.1383 0.1384 0.2316 0.0551 5.7762 2.8052 4.1555 80.1760 7.4980 17.1447 3.1697 0.0367 1.5799 1.8789 8.3959 49.4402 50.9744 251.9056 16.4611 27.5362 0.4703 10.5191 54.0596 1.6203 13.1928 30.0200 6.4606 8.0172 20.7582 40.7303 16.7246 11.2937 108.4926 29.0625 0.5860 30.4907 0.5958 59.5968 45.4670 4.3230 14.5393 37.8210 5.5262 23.0981 0.8794 7.1916 13.4025 26.6607 5.3361 16.8284 5.1552 15.5384
temp: 298.150 k
press: 1.00000 atm
elementType: 17 17 17 8 8 8 6 6 6 6 6 6 6 6 6 6 6 6 6 6 6 6 1 1 1 1 1 1 1 1 1 1 1 1 1 1 1
symmnumber: 1
zpe: 712055.8 jmol-1
zpe.correction: 0.271208 hartree
zpe.thermalcorrener: 0.293481 hartree
zpe.thermalcorrenthalpy: 0.294425 hartree
zpe.thermalcorrgfe: 0.216423 hartree
zpe.sumelectzpe: -2222.890211 hartree
zpe.sumelectthermal: -2222.867938 hartree
zpe.sumelectthermalent: -2222.866994 hartree
zpe.sumelectthermalfe: -2222.944996 hartree
dipole: 3.7397 -1.4643 0.0299
dipole: 4.0163
quadrupole: -144.3595 -155.7204 -142.4431
quadrupole: -5.3477 2.7780 -1.4446
quadrupole: 3.1482 -8.2127 5.0646 -5.3477 2.7780 -1.4446
hfenergy: -2223.161419 hartree
pointgroup: C01 [X(C16H15Cl3O3)]
dipole: -1.5701119 -0.0095769 0.1774229 debye
polarizability: 258.7826483|25.8177067|191.3100769|-25.1545679|-15.2084132|185.7924582 unknown
InChI: InChI=1S/C16H15Cl3O3/c1-21-13-8-7-12(15(20)16(17,18)19)9-14(13)22-10-11-5-3-2-4-6-11/h2-9,15,20H,10H2,1H3
charge 0 multiplicity 1
37 atoms
Cl 4.361577 2.06748 -2.289951
Cl 1.892358 2.785148 -0.714758
Cl 1.761579 0.647152 -2.883327
O  -1.05482 -0.469591 2.122363
O  4.011998 0.847529 0.573395
O  -0.874402 -3.320394 1.476566
C  2.067964 -0.627267 0.017091
C  3.208933 0.244346 -0.488248
C  -0.025357 -0.949404 1.285025
C  0.994268 -0.111284 0.781972
C  2.122726 -2.022429 -0.21894
C  0.024459 -2.354976 1.02183
C  1.116422 -2.867126 0.279526
C  2.823288 1.355281 -1.524588
C  -1.651466 0.876321 1.825193
C  -2.500268 0.860379 0.571949
C  -1.975117 1.294506 -0.672065
C  -3.833917 0.376948 0.62502
C  -2.766558 1.24106 -1.84182
C  -4.627279 0.32559 -0.541455
C  -4.093198 0.757057 -1.779425
C  -2.291046 -2.985765 1.724234
H  3.924064 -0.398542 -1.031346
H  0.942771 0.96014 0.996518
H  2.947959 -2.448716 -0.799901
H  1.136928 -3.945586 0.097182
H  -0.854392 1.640632 1.770857
H  -2.255696 1.061942 2.727717
H  3.408002 1.258819 1.244843
H  -0.948171 1.67227 -0.730743
H  -4.249521 0.046069 1.585185
H  -2.348381 1.578153 -2.796489
H  -5.657811 -0.04271 -0.487539
H  -4.708061 0.719464 -2.685624
H  -2.717504 -2.420247 0.876263
H  -2.402095 -2.399621 2.649639
H  -2.785935 -3.965128 1.81695
