program: Gaussian 09
title: 000190117
version: EM64L-G09RevD.01
frameworkgroup: C1[X(C23H20Cl2O3)]
method: RPBEPBE
basis: SDD
operation: Freq
keyword: #p
keyword: freq=noraman
keyword: PBEPBE/SDD
title: #p freq=noraman PBEPBE/SDD
converged: YES YES NO NO
title: Mulliken charges:
elementType: Cl Cl O O O C C C C C C C C C C C C C C C C C C C C C C C H H H H H H H H H H H H H H H H H H H H
charge: 0.021965 0.029341 -0.269484 -0.237256 -0.262085 0.357166 0.515906 0.265505 -0.522595 0.287135 0.153268 -0.419612 -0.337048 -0.389779 0.374531 -0.384485 -0.365791 -0.355497 -0.356321 0.316838 -0.677528 -0.377847 -0.411109 -0.229972 -0.218532 -0.240676 -0.537693 -0.537922 0.281271 0.252929 0.243492 0.221022 0.229625 0.250274 0.260038 0.241811 0.252759 0.225587 0.289072 0.225214 0.224639 0.226889 0.221287 0.247923 0.223442 0.223643 0.221472 0.247188
chargesum: 0.00000
title: Mulliken charges with hydrogens summed into heavy atoms:
elementType: Cl Cl O O O C C C C C C C C C C C C C C C C C C C C C C C
charge: 0.021965 0.029341 -0.269484 -0.237256 -0.262085 0.357166 0.515906 0.265505 -0.241323 0.287135 0.153268 -0.166683 -0.093555 0.060868 0.374531 -0.134211 -0.105752 -0.113687 -0.103562 0.316838 -0.677528 -0.152260 -0.122037 -0.004758 0.006107 -0.013787 0.154959 0.154380
polarizability: 4.15563017e+02 -1.66171952e+00 2.99429049e+02 1.04094356e+01 -4.46716786e+00 1.88272173e+02
1716.lowfreq: -6.7674 -4.5481 -2.7764 0.0014 0.0022 0.0024 8.3872 11.8068 27.1565
frequency: 8.3703 11.5004 27.0807 31.1627 39.1778 47.6326 52.5852 65.5568 87.2586 95.2458 99.3267 104.6119 148.7745 150.1587 160.9973 183.7448 193.9424 211.9281 225.3669 231.9324 239.2261 246.5682 265.1112 278.0804 290.8452 341.7187 345.1644 366.9466 383.1457 395.2600 402.1046 416.3889 452.0875 461.8559 467.4199 503.7558 520.9989 537.8657 555.1879 585.5499 604.7224 611.9364 620.6652 630.3097 668.9894 703.4535 714.8904 736.7626 740.2689 744.4206 745.2766 757.4856 796.7819 806.9444 816.6650 818.5824 840.6851 856.2034 857.6330 884.0325 914.5461 928.0371 946.6099 966.2814 973.2362 981.6059 982.3387 986.6574 989.2261 997.9140 1001.4941 1013.6519 1022.6403 1028.4414 1083.6052 1111.2178 1111.7420 1115.3740 1132.0203 1143.1029 1157.3203 1168.0714 1171.7480 1181.8224 1186.4235 1209.1792 1211.2758 1214.3411 1234.7675 1251.1140 1277.1618 1294.8840 1303.1983 1313.4287 1353.1744 1361.0654 1379.3588 1393.1187 1417.3363 1420.6177 1435.2112 1436.2908 1440.5296 1466.5817 1466.7580 1466.9957 1471.4103 1472.4002 1486.2482 1497.8689 1506.2365 1567.4240 1575.2110 1585.9783 1595.6488 1603.4136 1617.3739 1619.7205 2933.0796 2960.4867 2961.2023 2985.0813 3049.5098 3049.8473 3110.6857 3126.6767 3127.1490 3128.1977 3139.7526 3140.9650 3147.6439 3149.0121 3159.0239 3165.5679 3168.4457 3172.0942 3172.5141 3176.0951
redmass: 5.4745 4.4784 5.7981 4.4263 5.3731 6.2185 5.2157 9.4197 3.6359 5.8687 3.8621 3.8730 4.2861 6.2853 4.0817 3.7671 3.9080 3.5462 3.2028 1.5128 1.6621 3.3759 5.5337 5.2207 5.4981 5.5444 6.2595 8.1140 7.7845 5.2905 2.8455 2.9843 4.5369 3.2840 2.7663 5.0986 3.8293 5.6116 5.8873 5.0407 5.5222 6.2399 6.0280 6.1098 5.0134 2.3135 4.9156 3.0837 1.7020 5.3586 3.6895 5.7449 6.2567 1.5201 2.8785 1.5423 1.7977 2.3344 1.2947 2.2279 1.3113 1.3783 1.4089 3.5820 1.6079 1.3687 8.6216 8.8282 6.2914 1.3543 3.1593 3.1022 1.6735 2.1667 1.5894 1.2599 1.2599 1.3593 2.5602 1.5676 1.3344 1.6497 1.0522 1.2785 1.1153 2.3138 1.1068 2.4731 2.8385 3.3856 2.0439 2.1020 1.3008 1.4389 1.6912 5.1959 6.0775 3.9874 4.4458 4.0184 1.2049 1.1726 2.1861 1.0573 1.1192 1.0504 1.0695 1.0740 2.3115 2.4475 2.6729 8.2182 7.7189 9.0162 6.1802 6.3730 6.3040 6.0056 1.0549 1.0328 1.0329 1.1052 1.1040 1.1040 1.0877 1.0868 1.0994 1.0994 1.0884 1.0931 1.0878 1.0882 1.0986 1.0949 1.0933 1.0932 1.0971 1.0965
irintensity: 0.1031 0.0542 0.4388 0.8037 0.7374 0.3529 0.1681 0.1413 6.2686 2.8809 4.8308 0.4835 0.6917 0.8030 2.5690 2.7378 1.5464 6.5329 1.2268 0.5377 0.2552 0.5451 0.7723 2.4190 1.3954 0.7809 3.2828 4.5718 2.8267 0.3642 0.0409 0.4402 3.3933 0.7512 11.2327 7.9497 7.3223 41.2292 2.0869 41.2770 12.5845 2.4386 1.8873 7.7190 7.6214 27.2722 19.4700 11.0884 43.6657 4.2931 44.4604 66.0466 69.2933 35.1555 7.5057 2.2003 30.7180 18.6718 1.4402 37.0002 3.3933 0.7313 1.8058 11.1813 2.7483 0.0911 48.4154 41.4174 0.6772 0.1428 16.3875 105.1379 3.1115 4.5960 11.2359 0.1092 0.1544 9.4484 190.4832 15.4953 3.0192 20.4185 0.3657 101.5883 5.5622 79.1749 7.4138 24.9193 201.8684 210.0192 89.6758 126.8630 8.3807 2.3463 19.1023 10.0764 32.2084 2.1693 45.0021 23.1260 20.3076 9.5583 5.7872 20.0256 54.6529 13.8056 60.1416 56.9492 11.4238 70.0723 189.7162 23.7131 14.4827 31.6901 0.5415 56.4588 125.5215 8.3248 22.7748 71.7660 75.5394 24.3614 45.1991 44.2381 10.2011 1.7282 29.7607 21.3326 7.8963 31.8676 6.8762 5.4215 33.5771 14.0199 15.1288 1.7727 3.7550 8.2942
temp: 298.150 k
press: 1.00000 atm
elementType: 17 17 8 8 8 6 6 6 6 6 6 6 6 6 6 6 6 6 6 6 6 6 6 6 6 6 6 6 1 1 1 1 1 1 1 1 1 1 1 1 1 1 1 1 1 1 1 1
symmnumber: 1
zpe: 959715.0 jmol-1
zpe.correction: 0.365536 hartree
zpe.thermalcorrener: 0.392349 hartree
zpe.thermalcorrenthalpy: 0.393293 hartree
zpe.thermalcorrgfe: 0.303426 hartree
zpe.sumelectzpe: -2032.178178 hartree
zpe.sumelectthermal: -2032.151365 hartree
zpe.sumelectthermalent: -2032.150420 hartree
zpe.sumelectthermalfe: -2032.240287 hartree
dipole: 0.9436 4.2463 1.5200
dipole: 4.6078
quadrupole: -167.5038 -160.4515 -169.1507
quadrupole: 12.6205 7.3444 -5.9328
quadrupole: -1.8018 5.2505 -3.4487 12.6205 7.3444 -5.9328
hfenergy: -2032.5437138 hartree
pointgroup: C01 [X(C23H20Cl2O3)]
dipole: 0.3511478 -0.0187511 -1.7784267 debye
polarizability: 415.2959589|12.6110899|204.8974006|-3.9251616|39.5426348|283.070879 unknown
InChI: InChI=1S/C23H20Cl2O3/c1-26-19-11-8-17(9-12-19)22(23(24)25)18-10-13-20(27-2)21(14-18)28-15-16-6-4-3-5-7-16/h3-14H,15H2,1-2H3
charge 0 multiplicity 1
48 atoms
Cl 0.30883 -0.52032 3.635173
Cl 2.92472 0.931902 3.746111
O  -2.85584 -0.253169 -0.286284
O  -2.293502 -2.165486 -2.016206
O  6.864186 1.011503 -1.334373
C  0.815345 -0.684333 0.472065
C  1.908615 -0.133517 1.33561
C  -1.528571 -0.689747 -0.28934
C  -0.514793 -0.184199 0.546135
C  3.199462 0.194466 0.649659
C  -1.223823 -1.723746 -1.233311
C  1.109397 -1.691326 -0.476094
C  0.098875 -2.21119 -1.315382
C  -3.236146 0.762131 0.700967
C  -4.724684 1.035153 0.564375
C  3.184481 0.907225 -0.576591
C  4.457889 -0.236186 1.158426
C  4.375682 1.210464 -1.269478
C  5.651318 0.046552 0.475499
C  5.61743 0.778833 -0.738843
C  1.741371 0.061594 2.679046
C  -5.317939 2.020479 1.393481
C  -5.528282 0.329549 -0.361866
C  -6.699194 2.296842 1.29982
C  -6.911691 0.608912 -0.454806
C  -7.501963 1.590374 0.373123
C  -2.017005 -3.225622 -2.98985
C  6.887533 1.771789 -2.58704
H  -0.741096 0.61271 1.258341
H  2.130388 -2.077048 -0.555171
H  0.351996 -2.999468 -2.030035
H  -2.653044 1.691537 0.525139
H  -2.996547 0.394278 1.721707
H  2.225456 1.23289 -0.993674
H  4.498239 -0.81058 2.089061
H  4.323297 1.773085 -2.206123
H  6.619588 -0.290111 0.85768
H  -4.701861 2.573083 2.115026
H  -5.060501 -0.427346 -0.997338
H  -7.1475 3.059811 1.946157
H  -7.52781 0.058334 -1.174882
H  -8.574236 1.803939 0.298937
H  -1.270899 -2.898291 -3.739886
H  -2.981131 -3.416211 -3.482939
H  -1.662911 -4.147984 -2.489872
H  6.474792 2.789696 -2.447137
H  6.325904 1.249226 -3.385666
H  7.950076 1.836918 -2.86285
