program: Gaussian 09
title: 000190097
version: EM64L-G09RevD.01
frameworkgroup: C1[X(C19H21NO5S)]
method: RPBEPBE
basis: SDD
operation: Freq
keyword: #p
keyword: freq=noraman
keyword: PBEPBE/SDD
title: #p freq=noraman PBEPBE/SDD
converged: YES YES NO NO
title: Mulliken charges:
elementType: S O O O O O N C C C C C C C C C C C C C C C C C C C H H H H H H H H H H H H H H H H H H H H H
charge: 0.912958 -0.312492 -0.512325 -0.544324 -0.286290 -0.244192 -0.347918 0.013311 -0.390786 -0.360769 -0.246159 0.510584 -0.731326 -0.002209 -0.447474 -0.403625 -0.239165 -0.263656 -0.224254 -0.242152 -0.350268 -0.322935 0.251031 -0.237929 0.183539 -0.499067 0.234300 0.299639 0.236638 0.233868 0.225626 0.230943 0.234166 0.228764 0.263847 0.227603 0.306041 0.337779 0.297871 0.227360 0.230638 0.284089 0.282609 0.230301 0.246328 0.244450 0.235034
chargesum: 0.00000
title: Mulliken charges with hydrogens summed into heavy atoms:
elementType: S O O O O O N C C C C C C C C C C C C C C C C C C C
charge: 0.912958 -0.312492 -0.512325 -0.544324 -0.286290 -0.244192 -0.347918 0.247611 0.145490 0.098724 -0.015217 0.510584 -0.004549 -0.002209 -0.219871 -0.097584 0.098614 0.034215 0.003106 -0.011513 -0.066179 -0.040326 0.251031 -0.007628 0.183539 0.226744
polarizability: 3.69616281e+02 6.07600793e-01 2.33215079e+02 1.28320739e+01 -1.71138649e+01 1.78547109e+02
1716.lowfreq: -7.4461 -5.5831 -0.0019 -0.0012 -0.0009 5.0710 19.6620 28.8883 37.8791
frequency: 19.5951 28.7023 37.8265 44.0788 55.6105 63.3789 66.2380 76.8256 84.2765 92.5996 104.7248 117.9099 128.0846 147.1331 158.3537 179.9512 193.3721 210.2736 217.5545 235.0219 259.0840 262.6885 272.1528 290.8735 313.4085 320.0053 345.2888 349.7860 375.0463 402.4787 406.5047 408.5033 435.5481 462.5769 477.0589 499.1345 515.3171 550.9017 588.7946 615.2515 616.2803 635.9303 675.2006 680.5971 696.5467 712.7311 732.0185 751.0955 768.2749 776.7933 778.2532 793.6272 812.9081 866.0912 867.8821 886.1544 891.6699 913.5096 918.2650 936.7025 974.5641 987.3386 988.4803 993.5612 995.8359 997.2412 1001.4754 1013.9558 1015.5078 1029.0255 1042.9833 1047.3989 1063.2924 1070.5490 1081.0328 1097.0304 1107.4742 1115.0112 1115.5810 1127.6375 1132.2637 1149.1828 1173.5843 1184.2651 1200.3092 1208.1963 1237.5712 1249.7386 1270.7076 1285.7078 1301.1028 1312.1724 1345.7718 1347.5137 1383.5235 1389.7871 1392.4256 1392.6211 1395.0049 1423.9863 1442.5460 1447.5025 1451.4651 1458.9649 1462.9844 1468.5111 1471.5751 1483.4009 1490.5092 1583.6101 1590.8269 1591.9309 1611.1809 1627.9333 2935.1048 2947.0183 2995.5699 3005.3095 3006.2263 3068.9425 3086.2629 3090.7997 3104.8921 3108.6850 3108.9307 3109.3601 3120.7799 3131.3994 3144.4650 3151.8252 3159.1193 3162.2444 3166.3289 3179.8076 3184.9989
redmass: 5.9989 4.6572 5.6059 4.0995 4.2760 4.5718 4.8037 2.2865 2.5727 2.6204 4.5471 4.2025 5.0263 5.0501 5.8658 6.0500 4.7797 5.4839 3.9208 5.0804 1.7796 2.4227 4.1325 4.5365 5.1651 3.9998 6.2913 3.1305 6.4982 4.0904 2.8964 3.0983 3.6490 6.1272 4.2662 5.0874 5.8867 3.1729 4.1870 6.2041 7.0641 4.1110 5.0405 6.8346 4.9490 1.8246 2.9566 3.8174 6.1493 3.9572 2.0163 14.3088 2.8814 1.2528 1.3155 2.0206 1.9009 10.8381 7.9908 1.3988 1.8335 1.7213 2.4456 5.2817 1.3750 1.7561 1.6712 1.3592 1.3279 2.0578 1.4849 2.8072 2.3722 3.8422 1.7228 1.9972 1.4954 1.2662 1.4012 1.5285 2.0597 1.4793 1.0590 1.1491 1.1511 2.1356 1.4650 4.1038 1.1689 1.6287 1.2710 1.2191 1.8600 1.2465 5.0953 6.7364 1.4704 2.8517 1.2742 1.1846 1.9473 1.1180 1.0495 1.3033 1.0514 1.1267 1.9367 1.8528 1.1256 7.8189 5.8955 6.1272 5.7582 9.9643 1.0823 1.0603 1.0361 1.0990 1.0296 1.0523 1.0903 1.0994 1.0884 1.1046 1.0996 1.0959 1.0889 1.0902 1.0951 1.1049 1.0901 1.1012 1.0938 1.1192 1.0957
irintensity: 0.7880 1.4030 0.1510 0.0210 0.4076 0.1767 1.0576 0.3494 1.2234 0.5697 0.0099 9.2112 0.7483 7.5430 1.2169 5.5906 1.6642 8.7691 4.7338 0.3525 6.4007 1.2113 19.3734 3.1561 15.4425 3.4946 17.0907 14.0585 14.8877 15.6566 0.1651 1.8562 4.3228 46.2522 3.0321 13.7386 111.8331 15.3106 21.2057 1.6886 6.1550 27.3613 30.3042 18.4207 17.6059 51.3609 9.1389 17.8830 18.3096 5.3516 35.2418 64.4664 60.9925 0.2390 13.1700 46.9600 5.9740 75.2739 3.4370 3.5020 9.4447 0.2459 2.4121 29.2132 0.3724 12.7207 6.7480 0.9044 3.0515 10.0656 4.3759 64.8110 18.3025 161.2823 9.3279 18.2377 12.9541 0.1210 5.2026 7.2129 17.8149 58.7828 0.1861 7.3608 0.4372 25.1510 6.5760 334.9834 8.1750 40.6292 1.5162 23.9438 9.2793 3.9804 3.3369 15.3057 6.6766 19.0970 16.2165 31.8185 17.2892 17.7314 14.9750 4.9170 12.4992 13.6200 6.2554 11.5029 22.4044 17.5779 5.7160 29.7475 3.2519 182.0268 12.1806 32.0408 19.3760 6.7601 39.9859 22.4366 35.8237 36.2308 10.0510 23.1517 7.5385 58.1823 15.4070 5.6606 23.4661 14.6794 4.1073 45.1199 0.3330 31.2268 0.6496
temp: 298.150 k
press: 1.00000 atm
elementType: 16 8 8 8 8 8 7 6 6 6 6 6 6 6 6 6 6 6 6 6 6 6 6 6 6 6 1 1 1 1 1 1 1 1 1 1 1 1 1 1 1 1 1 1 1 1 1
symmnumber: 1
zpe: 950516.0 jmol-1
zpe.correction: 0.362032 hartree
zpe.thermalcorrener: 0.388236 hartree
zpe.thermalcorrenthalpy: 0.389180 hartree
zpe.thermalcorrgfe: 0.303786 hartree
zpe.sumelectzpe: -1563.411717 hartree
zpe.sumelectthermal: -1563.385513 hartree
zpe.sumelectthermalent: -1563.384569 hartree
zpe.sumelectthermalfe: -1563.469963 hartree
dipole: 0.5969 -0.3669 -5.0952
dipole: 5.1432
quadrupole: -129.7389 -158.8655 -168.3305
quadrupole: 22.6654 -1.3702 -3.9099
quadrupole: 22.5727 -6.5539 -16.0189 22.6654 -1.3702 -3.9099
hfenergy: -1563.773749 hartree
pointgroup: C01 [X(C19H21N1O5S1)]
dipole: 0.3528119 1.6005021 -1.1867577 debye
polarizability: 365.9915121|-11.9223203|210.4160837|26.2527775|30.8212232|204.9708732 unknown
InChI: InChI=1S/C19H21NO5S/c1-14(15-6-4-3-5-7-15)20(12-17-13-25-17)26(22,23)18-10-8-16(9-11-18)19(21)24-2/h3-11,14,17H,12-13H2,1-2H3
charge 0 multiplicity 1
47 atoms
S  0.405189 -1.347226 0.425664
O  -0.208307 1.588877 3.107326
O  0.384196 -2.050154 1.898377
O  0.95216 -2.211699 -0.855197
O  -5.848459 -0.286128 -2.09791
O  -6.083202 1.008896 -0.175357
N  1.249457 0.381459 0.70242
C  1.286938 1.577973 2.883504
C  1.860024 0.436207 2.048816
C  0.462677 2.689075 2.312135
C  2.085594 0.933881 -0.425947
C  3.538077 0.438537 -0.505558
C  1.342841 0.856329 -1.777409
C  -1.35073 -0.802958 -0.009648
C  4.592409 1.356274 -0.263014
C  3.861174 -0.905803 -0.828885
C  -2.042299 0.014078 0.901494
C  -1.896293 -1.300606 -1.203622
C  5.944264 0.950123 -0.346628
C  5.211225 -1.312681 -0.907699
C  -3.371915 0.354338 0.575419
C  -3.228747 -0.951569 -1.509531
C  -3.965655 -0.125522 -0.622146
C  6.257028 -0.3895 -0.66913
C  -5.379394 0.269269 -0.905172
C  -7.24884 0.049407 -2.448864
H  1.851733 1.773211 3.806999
H  1.652218 -0.516934 2.579917
H  2.961691 0.545505 1.986629
H  0.223179 2.662621 1.242422
H  0.460108 3.672827 2.796447
H  2.133347 2.010731 -0.148774
H  1.878835 1.472302 -2.519764
H  0.313946 1.246204 -1.676506
H  1.299174 -0.175649 -2.161629
H  4.355339 2.39957 -0.014286
H  3.058212 -1.630132 -1.011357
H  -1.55823 0.385332 1.813768
H  -1.296004 -1.939371 -1.858904
H  6.745908 1.673231 -0.158444
H  5.447257 -2.353719 -1.155553
H  -3.964738 0.990621 1.240007
H  -3.703514 -1.314537 -2.424427
H  7.302512 -0.711675 -0.732346
H  -7.933147 -0.299277 -1.657471
H  -7.360662 1.140028 -2.568888
H  -7.434475 -0.47637 -3.395581
