program: Gaussian 09
title: 000190096
version: EM64L-G09RevD.01
frameworkgroup: C1[X(C18H11NO2)]
method: RPBEPBE
basis: SDD
operation: Freq
keyword: #p
keyword: freq=noraman
keyword: PBEPBE/SDD
title: #p freq=noraman PBEPBE/SDD
converged: YES YES NO NO
title: Mulliken charges:
elementType: O O N C C C C C C C C C C C C C C C C C C H H H H H H H H H H H
charge: -0.178015 -0.195702 -0.030738 0.277455 0.259806 0.113939 0.159451 0.443111 0.429869 -0.427095 -0.380243 0.247917 -0.509935 -0.525780 -0.344439 -0.447525 -0.436224 -0.367368 -0.242413 -0.258853 -0.245980 0.228689 0.250036 0.241602 0.241259 0.220734 0.251856 0.246053 0.272059 0.243546 0.230145 0.232786
chargesum: 0.00000
title: Mulliken charges with hydrogens summed into heavy atoms:
elementType: O O N C C C C C C C C C C C C C C C C C C
charge: -0.178015 -0.195702 -0.030738 0.277455 0.259806 0.113939 0.159451 0.443111 0.429869 -0.198406 -0.130208 0.247917 -0.268333 -0.284520 -0.123705 -0.195669 -0.190171 -0.095310 0.001132 -0.028709 -0.013194
polarizability: 3.81250101e+02 1.41614423e+01 2.34315502e+02 -1.40076279e+01 9.60975170e+00 9.07487246e+01
1716.lowfreq: -9.0526 -4.8510 0.0003 0.0006 0.0006 4.9128 44.9666 55.9426 68.2510
frequency: 44.9436 55.9333 68.2431 100.9454 144.6461 170.0283 183.8421 213.3012 243.7022 273.1653 303.0873 327.1700 378.0467 402.0632 415.5705 462.0604 479.6396 499.9782 504.9597 528.1909 550.2282 562.3119 568.8130 574.6040 626.5951 672.3075 676.6294 691.9967 703.0238 746.2781 756.0843 766.1855 778.7008 792.5837 818.0270 840.2665 852.3452 854.3796 868.0642 888.7783 926.0370 949.9180 956.6881 972.8188 979.3636 988.9923 994.5512 1012.6905 1040.4167 1083.3945 1102.6063 1146.0714 1165.2453 1178.0831 1191.5486 1201.5899 1221.7658 1234.9010 1247.1658 1253.4153 1273.1145 1295.3434 1343.6647 1362.5960 1390.6194 1399.8405 1407.7875 1416.8920 1425.8161 1435.9596 1449.4541 1490.8969 1520.7132 1528.1781 1567.8227 1600.6041 1608.4831 1620.0070 1628.1061 3126.7395 3134.1091 3135.9844 3136.8864 3138.1068 3153.3452 3161.6083 3166.5851 3175.1652 3180.2940 3195.8947
redmass: 6.6940 5.4074 10.5672 4.4603 7.1161 5.9810 4.2596 5.9833 3.9009 5.9562 5.9204 6.9499 4.6073 5.2380 3.5262 3.9379 5.7628 5.1053 3.5275 4.9228 4.5741 3.4206 6.2097 5.9287 4.2601 5.4199 5.0675 8.0647 4.4887 1.7255 5.6262 1.6641 1.5529 6.1929 1.6805 2.5169 1.7094 4.5114 4.8349 1.9294 1.4276 5.3217 1.3925 1.3733 1.3870 1.4063 1.3602 6.1515 2.2171 2.5509 2.4072 1.6315 1.3175 1.0992 1.2935 1.6621 5.1331 2.2928 1.8802 1.7792 1.7127 2.1450 3.1289 11.8209 3.6204 4.5541 5.3372 2.8860 2.3982 2.9028 2.1840 3.0485 4.9555 3.5870 7.9071 6.1217 6.2896 6.9405 6.4791 1.0860 1.0887 1.0897 1.0890 1.0892 1.0947 1.0920 1.1001 1.0937 1.0982 1.0933
irintensity: 0.2318 2.0264 1.2712 0.2274 1.1922 0.2338 0.7013 1.2861 6.7441 1.4101 0.3028 1.2326 0.7561 1.3600 6.2055 4.8662 1.7234 3.5974 2.6908 1.8321 2.2831 0.1857 1.4863 0.6994 9.4802 4.3625 2.9709 16.3541 7.9866 4.6377 14.0044 98.9535 1.0881 7.8316 2.7739 27.4030 60.8404 0.8099 1.5386 12.1651 3.5393 1.2152 1.0054 0.4662 4.4939 1.4956 1.1756 0.1023 8.9712 4.9381 5.0174 1.7481 1.6141 3.0534 1.7287 33.2269 159.6967 6.9979 18.6505 11.1340 15.9273 3.6507 0.5200 145.7203 16.4111 1.3417 1.0112 24.5512 13.5053 3.7567 4.2335 11.9086 7.3975 1.5459 3.5041 8.2028 2.1585 0.2311 1.3795 1.1784 0.4799 3.2171 0.5660 21.8616 21.9214 12.4831 25.9182 30.7453 7.0305 6.5777
temp: 298.150 k
press: 1.00000 atm
elementType: 8 8 7 6 6 6 6 6 6 6 6 6 6 6 6 6 6 6 6 6 6 1 1 1 1 1 1 1 1 1 1 1
symmnumber: 1
zpe: 626278.6 jmol-1
zpe.correction: 0.238537 hartree
zpe.thermalcorrener: 0.253639 hartree
zpe.thermalcorrenthalpy: 0.254583 hartree
zpe.thermalcorrgfe: 0.195995 hartree
zpe.sumelectzpe: -896.255964 hartree
zpe.sumelectthermal: -896.240862 hartree
zpe.sumelectthermalent: -896.239918 hartree
zpe.sumelectthermalfe: -896.298506 hartree
dipole: -1.4364 4.4984 -0.9300
dipole: 4.8129
quadrupole: -98.8035 -113.2591 -129.0847
quadrupole: 13.7947 -1.1311 4.6264
quadrupole: 14.9123 0.4567 -15.3689 13.7947 -1.1311 4.6264
hfenergy: -896.4945008 hartree
pointgroup: C01 [X(C18H11N1O2)]
dipole: -0.5257561 1.759922 -0.4601561 debye
polarizability: 381.9497|10.4112345|234.4352966|-12.3664169|2.600888|89.9293306 unknown
InChI: InChI=1S/C18H11NO2/c20-19(21)17-7-3-5-13-9-10-15-14-6-2-1-4-12(14)8-11-16(15)18(13)17/h1-11H
charge 0 multiplicity 1
32 atoms
O  1.858684 -2.258818 1.545417
O  3.280968 -2.831996 -0.145564
N  2.570434 -1.97056 0.508173
C  0.09946 -0.125663 -0.071636
C  -0.950178 0.852058 0.03192
C  1.494787 0.30918 -0.001407
C  -2.35041 0.428853 0.041818
C  1.789463 1.725078 -0.073451
C  -2.665396 -0.96658 -0.144874
C  -0.604848 2.250515 0.071209
C  -0.268682 -1.499778 -0.319314
C  2.648535 -0.54649 0.090557
C  0.70764 2.671654 -0.029323
C  -1.592346 -1.899687 -0.361595
C  -3.439516 1.33886 0.231562
C  3.135535 2.194636 -0.183133
C  -4.027813 -1.400207 -0.141223
C  3.964056 -0.082332 -0.060923
C  4.212208 1.304889 -0.219796
C  -4.767296 0.8939 0.238124
C  -5.069022 -0.486803 0.048414
H  -1.396258 3.001719 0.129381
H  0.496913 -2.247796 -0.527799
H  0.947716 3.739988 -0.067723
H  -1.839457 -2.947549 -0.566317
H  -3.248077 2.403869 0.390648
H  3.307042 3.275363 -0.242186
H  -4.241836 -2.465335 -0.287211
H  4.786777 -0.800842 -0.007695
H  5.239414 1.666054 -0.324428
H  -5.580504 1.611095 0.393857
H  -6.11059 -0.825273 0.054619
