program: Gaussian 09
title: 000190091
version: EM64L-G09RevD.01
frameworkgroup: C1[X(C16H20O7)]
method: RPBEPBE
basis: SDD
operation: Freq
keyword: #pfreq=noraman
keyword: PBEPBE/SDD
title: #p freq=noraman PBEPBE/SDD
converged: YES YES NO NO
title: Mulliken charges:
elementType: O O O O O O O C C C C C C C C C C C C C C C C H H H H H H H H H H H H H H H H H H H H
charge: -0.287863 -0.428932 -0.503583 -0.193883 -0.233267 -0.461227 -0.258159 -0.000694 -0.478849 -0.384778 -0.114065 -0.352899 -0.545208 -0.714067 0.246857 0.176036 0.201548 0.175949 -0.372380 -0.334681 -0.221147 -0.218721 0.088635 0.212055 0.209665 0.225272 0.200631 0.214522 0.314049 0.263834 0.239772 0.256014 0.241816 0.216660 0.222213 0.209309 0.327614 0.266984 0.406060 0.271733 0.238759 0.237721 0.440695
chargesum: 0.00000
title: Mulliken charges with hydrogens summed into heavy atoms:
elementType: O O O O O O O C C C C C C C C C C C C C C C C
charge: -0.287863 -0.101318 -0.097523 -0.193883 -0.233267 -0.020532 -0.258159 0.211361 -0.043912 0.030375 0.199984 0.150708 -0.047379 -0.065885 0.246857 0.176036 0.201548 0.175949 -0.105395 -0.062948 0.017612 0.019000 0.088635
polarizability: 2.43404598e+02 3.58349720e+00 2.02253765e+02 -1.79089800e+01 1.64835975e+01 1.44450531e+02
1716.lowfreq: -0.0004 0.0004 0.0007 4.1179 7.7423 9.7393 27.7002 38.5758 41.7948
frequency: 27.5684 38.5387 41.7685 60.7423 68.6156 77.1420 82.8075 90.0875 93.6419 105.8849 119.3090 125.4972 142.2359 164.9694 193.2333 207.0391 222.3792 234.1867 251.0427 268.9165 295.3054 317.9192 327.9300 357.6227 372.0792 395.5194 410.0096 411.2017 422.4402 438.3602 486.8877 520.7691 542.0008 553.6925 575.8414 599.8000 620.8371 657.2720 667.5827 693.0342 704.4969 755.5615 765.3955 777.1977 791.2774 793.0061 810.9919 815.8173 835.5711 870.4796 895.0046 905.4584 918.7577 936.9947 975.4884 975.9876 1003.8208 1006.4276 1017.0705 1026.7978 1034.6495 1040.6768 1061.2500 1074.0352 1076.2002 1093.8294 1118.0141 1134.2084 1145.7360 1174.3860 1176.4062 1193.9977 1207.1706 1225.7619 1233.2262 1244.7353 1258.8889 1278.3988 1288.0662 1296.6609 1308.8462 1325.1131 1334.2627 1354.8690 1362.4838 1367.1613 1369.1929 1382.2172 1390.2866 1391.8389 1431.8054 1444.8784 1458.6018 1470.5234 1476.2808 1478.8909 1487.5632 1492.4529 1579.6379 1601.5200 1618.5897 1626.2933 1703.0836 2972.0816 2973.3186 2976.2771 2976.5502 3014.4323 3014.8537 3026.4264 3040.1564 3065.9483 3069.2155 3073.5552 3078.2802 3088.2856 3092.6076 3137.8065 3152.1724 3166.0137 3177.2305 3538.0770 3541.4061
redmass: 6.7326 6.2069 5.5533 6.1199 4.3933 3.9617 5.3478 3.8347 4.1033 4.0455 6.3421 4.9934 4.3025 4.7949 2.6397 5.8061 1.7407 6.5980 4.3623 4.2452 3.4589 2.8746 1.4300 6.0323 2.5256 5.2884 3.3934 3.2934 2.7341 2.4632 2.2516 4.2765 5.1056 3.7516 1.4204 3.2322 5.9787 5.7048 5.8418 4.3263 4.0887 3.6674 1.8806 2.2382 1.8567 2.5324 3.6617 4.3566 3.9499 2.5163 1.9338 1.5912 2.0023 1.4603 1.4306 1.4117 1.3542 3.4905 1.6008 3.9564 4.7876 2.4306 2.1997 2.5352 1.9157 2.7876 1.8582 2.0400 1.6508 1.5291 1.0650 1.3494 1.9287 1.1712 2.5040 1.2959 1.4664 1.5364 1.5749 1.3666 1.2874 1.3233 1.3178 1.5224 1.5535 1.5755 1.4805 9.6959 1.1866 1.1775 2.2608 1.1038 1.0955 1.0640 2.5780 1.0736 1.0564 1.0864 7.1860 6.6099 7.5036 11.8254 8.7293 1.0641 1.0505 1.0537 1.0706 1.0594 1.0591 1.0994 1.0961 1.0918 1.0997 1.0993 1.1070 1.0790 1.0915 1.0862 1.0909 1.0958 1.0990 1.0658 1.0644
irintensity: 0.9507 0.6890 0.7607 0.3248 0.4118 2.0971 1.9069 2.0115 1.3230 2.1404 6.0544 0.6947 6.3048 2.2435 5.4013 2.6626 3.7867 3.8226 0.5695 10.4167 6.2391 26.5010 108.9118 2.0084 12.4561 0.6403 4.9362 3.7637 1.4398 4.7237 7.2851 0.8925 16.6647 19.9726 121.6918 12.8138 33.1854 16.6190 2.6479 10.9810 53.4112 14.0844 7.8533 39.5477 19.5978 16.5667 33.9332 3.4734 6.7667 10.1858 18.0829 3.3409 16.3118 44.0168 13.8645 20.0996 2.2037 34.2414 11.3976 69.7598 78.4100 39.5919 11.2243 61.8518 624.7477 49.6717 40.5733 8.8240 17.5089 27.2352 2.1922 55.3610 192.0345 5.3287 264.6853 11.0249 4.7339 44.2492 43.9085 3.4453 3.1244 3.8987 8.5053 8.3651 14.7587 9.4733 20.0386 12.1686 11.9348 8.6460 7.3020 2.1410 27.4216 5.1902 22.0409 10.8400 14.9729 16.6424 25.8937 69.0526 155.3219 189.4782 317.7709 24.0930 6.1411 58.5073 10.3891 14.0831 5.2371 10.3504 29.6010 0.1443 52.7193 39.5926 28.8536 908.1340 281.7874 2.7924 7.9410 8.4111 14.2240 4.2045 49.7768
temp: 298.150 k
press: 1.00000 atm
elementType: 8 8 8 8 8 8 8 6 6 6 6 6 6 6 6 6 6 6 6 6 6 6 6 1 1 1 1 1 1 1 1 1 1 1 1 1 1 1 1 1 1 1 1
symmnumber: 1
zpe: 890324.9 jmol-1
zpe.correction: 0.339107 hartree
zpe.thermalcorrener: 0.362526 hartree
zpe.thermalcorrenthalpy: 0.363470 hartree
zpe.thermalcorrgfe: 0.285247 hartree
zpe.sumelectzpe: -1146.556295 hartree
zpe.sumelectthermal: -1146.532876 hartree
zpe.sumelectthermalent: -1146.531931 hartree
zpe.sumelectthermalfe: -1146.610154 hartree
dipole: 0.1064 -0.4748 -4.6065
dipole: 4.6321
quadrupole: -128.8600 -123.1425 -144.1038
quadrupole: -11.6237 -4.7510 -3.3733
quadrupole: 3.1754 8.8929 -12.0683 -11.6237 -4.7510 -3.3733
hfenergy: -1146.8954014 hartree
pointgroup: C01 [X(C16H20O7)]
dipole: -0.178253 -0.0824472 1.8118078 debye
polarizability: 245.7608546|-0.4814293|199.7341808|-8.7780917|-20.8449213|144.6138575 unknown
InChI: InChI=1S/C16H20O7/c1-2-10(7-11(17)8-14(18)19)9-23-16(22)13-6-4-3-5-12(13)15(20)21/h3-6,10-11,17-18,20H,2,7-9H2,1H3
charge 0 multiplicity 1
43 atoms
O  -0.579882 1.290283 -0.433358
O  3.715197 0.439891 -0.643647
O  2.410154 -3.01159 0.16215
O  4.642421 -2.532922 0.581323
O  -2.116425 1.751526 -2.135813
O  -0.185813 -2.443796 0.621407
O  -0.182385 -1.314771 -1.405122
C  1.523771 2.520236 -0.122546
C  1.971971 1.410712 0.867214
C  0.961128 3.758875 0.629843
C  2.546209 0.143559 0.200809
C  0.512863 2.004166 -1.159496
C  2.898825 -0.921451 1.290026
C  1.98537 4.484963 1.529189
C  3.455016 -2.185023 0.682725
C  -1.780066 1.105081 -1.117397
C  -2.640081 0.095359 -0.413644
C  -2.130378 -1.148456 0.060958
C  -3.997662 0.424072 -0.192981
C  -2.974602 -2.011601 0.801266
C  -4.838099 -0.450859 0.529412
C  -4.321379 -1.663653 1.040516
C  -0.759997 -1.611203 -0.326659
H  2.41085 2.839611 -0.710228
H  2.737224 1.825869 1.555048
H  1.100878 1.12059 1.485872
H  0.580661 4.476584 -0.124792
H  0.08516 3.446468 1.232789
H  1.821991 -0.29088 -0.506918
H  0.9552 1.267652 -1.853973
H  0.073235 2.829711 -1.747134
H  1.984065 -1.151544 1.864481
H  3.658999 -0.512554 1.979396
H  2.311171 3.860109 2.380697
H  1.549322 5.409219 1.95016
H  2.886642 4.771823 0.954075
H  4.434982 0.825773 -0.079998
H  -4.380202 1.372223 -0.584206
H  2.798257 -3.787862 -0.321553
H  -2.566387 -2.958032 1.166979
H  -5.886899 -0.184388 0.697542
H  -4.967142 -2.340853 1.609435
H  0.754536 -2.723217 0.348254
