program: Gaussian 09
title: 000190084
version: EM64L-G09RevD.01
frameworkgroup: C1[X(C20H17FO2)]
method: RPBEPBE
basis: SDD
operation: Freq
keyword: #p
keyword: freq=noraman
keyword: PBEPBE/SDD
title: #p freq=noraman PBEPBE/SDD
converged: YES YES NO NO
title: Mulliken charges:
elementType: F O O C C C C C C C C C C C C C C C C C C C C H H H H H H H H H H H H H H H H H
charge: -0.186289 -0.425987 -0.422781 0.108283 -0.322025 0.263012 0.032987 0.126162 0.042862 0.283869 -0.287633 0.141013 -0.533536 0.271504 -0.422970 0.415184 -0.859014 -0.882433 -0.513977 -0.357579 -0.448037 -0.266304 -0.252389 0.271640 0.288792 0.276946 0.253595 0.237474 0.238000 0.283544 0.275703 0.248545 0.225337 0.238432 0.260930 0.346553 0.243469 0.344861 0.229760 0.232499
chargesum: 0.00000
title: Mulliken charges with hydrogens summed into heavy atoms:
elementType: F O O C C C C C C C C C C C C C C C C C C C C
charge: -0.186289 -0.079434 -0.077921 0.108283 -0.050386 0.263012 0.032987 0.126162 0.042862 0.283869 0.001158 0.141013 -0.256589 0.271504 -0.169375 0.415184 -0.099997 -0.132848 -0.275545 -0.096648 -0.204568 -0.036544 -0.019890
polarizability: 4.01919726e+02 7.65149480e+00 2.37820422e+02 3.70641839e+00 -1.29250354e+01 1.18144391e+02
1716.lowfreq: -0.0006 -0.0002 0.0006 4.7714 9.6587 12.0364 41.8313 44.7855 70.6723
frequency: 41.7933 44.7681 70.6680 81.6207 105.1248 112.9251 129.4393 163.0042 181.6239 207.7086 222.5641 243.3457 248.5902 264.9581 280.3592 294.8730 307.1312 319.5027 346.1674 372.9901 376.3436 391.6567 403.3950 433.0551 449.8954 463.6735 475.3652 521.1139 532.6223 554.8494 569.4968 576.8076 590.9472 617.3744 632.3104 650.1876 675.3124 688.8079 721.1866 752.0073 762.8824 778.3460 806.0695 833.7899 839.3809 874.1896 885.1024 887.3857 913.2829 925.8877 944.8922 960.0246 978.8035 986.0661 992.2196 1024.3536 1034.7539 1038.8304 1041.1104 1045.9088 1066.9767 1098.3855 1121.0438 1135.5609 1163.5831 1179.9322 1192.4861 1201.5090 1219.9135 1238.1548 1245.9041 1264.6365 1284.3781 1297.0120 1328.4251 1341.8137 1357.0839 1372.1723 1380.2649 1386.8665 1398.0905 1400.2729 1403.2529 1414.0150 1422.6603 1444.2659 1463.5341 1484.1667 1493.4202 1505.0005 1513.7941 1517.1241 1560.7761 1580.5298 1612.2615 1624.5328 1662.0297 2971.9292 2982.0754 3059.8752 3065.8971 3083.2909 3088.2702 3102.1331 3115.2713 3123.1276 3129.5543 3136.6431 3160.0866 3169.1406 3172.0720 3200.5984 3539.0688 3548.3023
redmass: 5.4543 5.2809 5.1140 2.4137 4.0252 1.4667 5.9324 4.6175 4.8980 4.2622 5.3710 3.7378 3.7414 2.8071 1.2970 1.9160 1.2039 3.3035 3.4092 3.3686 3.7300 3.0545 5.6802 4.5305 3.3353 4.6400 4.3161 5.6618 4.6618 3.5695 4.3992 5.7083 4.1199 5.3340 3.7900 5.9043 5.1994 4.5465 3.9711 3.8741 1.3116 3.9571 3.3051 1.7070 4.5653 2.5278 1.6086 1.8292 4.2612 4.0043 5.4836 1.3617 1.4262 3.7261 1.3766 2.2017 1.5587 1.5739 1.8004 2.1381 2.8332 3.2174 2.4941 2.0532 1.5541 1.1099 1.2681 1.6415 1.3286 2.0540 1.6528 1.7098 2.5201 2.1799 2.5683 1.2995 1.2530 3.2920 2.1447 7.1239 1.6519 1.2281 1.6710 3.6263 2.6470 2.5150 1.1427 1.1330 2.3842 1.1583 2.8556 1.3388 6.7413 6.4091 5.9978 6.7393 8.3571 1.0445 1.0437 1.0907 1.0930 1.0856 1.0861 1.0975 1.0953 1.0870 1.0886 1.0904 1.0985 1.0947 1.0911 1.0924 1.0664 1.0664
irintensity: 0.6173 0.0802 0.0788 1.7793 0.3503 1.8578 0.7393 0.3044 4.3113 2.3999 1.6247 1.9578 4.0212 3.4678 69.7144 20.9984 82.2371 19.8186 3.4051 1.6428 4.0903 6.7848 2.1625 7.4418 2.2587 0.8025 1.4782 1.3268 1.7667 7.3615 9.0788 1.4518 13.8452 19.5399 3.8841 0.7924 14.1552 11.5786 2.8841 7.3576 51.1965 13.4044 7.6653 54.2652 11.5115 21.2425 1.8124 63.5422 72.0111 82.8409 36.3610 3.6910 0.2994 10.4515 0.3452 1.3752 1.3491 7.1840 16.3277 2.3739 6.1163 25.3667 47.6289 64.4412 4.2598 2.0230 63.6786 13.8725 22.2562 4.8999 10.3798 13.1551 0.3629 22.7985 2.3190 14.5365 45.5641 3.4977 72.7940 5.7772 29.5221 14.4595 15.2250 7.6934 5.1004 4.7577 13.8607 11.7598 6.6257 25.8136 5.5574 9.5072 0.2479 5.3785 2.5257 0.8646 62.8712 24.6172 22.4743 15.6892 13.5415 7.7094 7.2669 7.2679 7.2542 1.9079 5.3640 16.3079 40.6900 20.6720 9.8119 11.2657 13.4732 11.7882
temp: 298.150 k
press: 1.00000 atm
elementType: 9 8 8 6 6 6 6 6 6 6 6 6 6 6 6 6 6 6 6 6 6 6 6 1 1 1 1 1 1 1 1 1 1 1 1 1 1 1 1 1
symmnumber: 1
zpe: 823581.1 jmol-1
zpe.correction: 0.313685 hartree
zpe.thermalcorrener: 0.333402 hartree
zpe.thermalcorrenthalpy: 0.334346 hartree
zpe.thermalcorrgfe: 0.266581 hartree
zpe.sumelectzpe: -1021.004157 hartree
zpe.sumelectthermal: -1020.984441 hartree
zpe.sumelectthermalent: -1020.983497 hartree
zpe.sumelectthermalfe: -1021.051262 hartree
dipole: -4.7885 -0.3458 0.0387
dipole: 4.8012
quadrupole: -146.2969 -123.1501 -137.3892
quadrupole: 1.0036 2.3883 -5.0052
quadrupole: -10.6848 12.4620 -1.7772 1.0036 2.3883 -5.0052
hfenergy: -1021.317843 hartree
pointgroup: C01 [X(C20H17F1O2)]
dipole: -1.8824045 0.156334 -0.0122212 debye
polarizability: 401.6796954|-9.7760138|236.4937915|-4.9722897|-18.5415736|119.7110517 unknown
InChI: InChI=1S/C20H17FO2/c1-10-13-8-7-12-5-3-4-6-14(12)17(13)11(2)15-9-16(21)19(22)20(23)18(10)15/h3-9,19-20,22-23H,1-2H3
charge 0 multiplicity 1
40 atoms
F  4.719441 2.254564 -0.251254
O  3.415022 -1.415742 -1.757057
O  4.355447 -0.281824 1.680753
C  1.663481 -0.741855 -0.133914
C  3.126804 -1.129665 -0.328619
C  1.313965 0.657019 -0.099916
C  0.665576 -1.72258 0.002128
C  -1.086384 0.087197 0.02517
C  -0.038605 1.080008 0.01862
C  -0.710649 -1.309044 0.128782
C  4.147023 -0.098738 0.223796
C  -2.524951 0.408082 -0.050989
C  2.39554 1.653936 -0.225139
C  3.699846 1.293154 -0.102309
C  -1.727849 -2.296565 0.418867
C  -3.497904 -0.609139 0.28057
C  1.008485 -3.205568 -0.033204
C  -0.302983 2.558397 0.2904
C  -3.056658 -1.953045 0.557499
C  -3.041727 1.657293 -0.526443
C  -4.894958 -0.309575 0.262053
C  -4.418491 1.924189 -0.56906
C  -5.358838 0.94772 -0.13907
H  3.363535 -2.075329 0.181615
H  5.131652 -0.32113 -0.217855
H  2.152885 2.698781 -0.434422
H  -1.425538 -3.33586 0.570034
H  0.272923 -3.771065 -0.630445
H  1.021759 -3.648295 0.981972
H  1.989625 -3.38261 -0.49644
H  -1.237516 2.69904 0.854237
H  0.509627 2.98308 0.903636
H  -0.370184 3.171503 -0.63026
H  -3.804375 -2.708189 0.826392
H  -2.36238 2.412324 -0.922129
H  2.994775 -0.70862 -2.311699
H  -5.603156 -1.098869 0.541012
H  3.548029 0.040451 2.160301
H  -4.76954 2.888943 -0.951513
H  -6.431554 1.167623 -0.156697
