program: Gaussian 09
title: 000190076
version: EM64L-G09RevD.01
frameworkgroup: C1[X(C5H12N2O2)]
method: RPBEPBE
basis: SDD
operation: Freq
keyword: #p
keyword: freq=noraman
keyword: PBEPBE/SDD
title: #p freq=noraman PBEPBE/SDD
converged: NO YES NO NO
title: Mulliken charges:
elementType: O O N N C C C C C H H H H H H H H H H H H
charge: -0.426574 -0.311721 -0.097869 0.069637 0.266731 -0.653570 -0.691918 -0.671020 -0.341488 0.229734 0.235405 0.210881 0.232383 0.238996 0.200264 0.209184 0.223062 0.231866 0.252891 0.222781 0.370346
chargesum: 0.00000
title: Mulliken charges with hydrogens summed into heavy atoms:
elementType: O O N N C C C C C
charge: -0.056229 -0.311721 -0.097869 0.069637 0.266731 0.022451 -0.020276 -0.006909 0.134184
polarizability: 9.19618201e+01 -6.58933332e+00 7.77541080e+01 6.97631189e-01 -1.54905630e+00 6.30750704e+01
1716.lowfreq: -21.7147 -10.6763 -5.9606 -0.0006 -0.0004 0.0006 49.5919 83.3673 146.8127
frequency: 49.4414 83.3507 146.7783 188.8852 225.3232 241.8178 272.2344 291.5517 314.4591 328.7951 340.7172 376.2467 419.4064 459.8916 537.1711 562.7774 590.4267 788.6339 829.9003 913.9991 914.5929 931.5021 951.7264 975.1923 1009.0885 1026.9605 1082.6517 1097.0691 1199.1174 1228.1901 1248.8620 1287.9270 1301.4638 1347.0061 1376.7341 1383.9866 1400.7517 1410.7642 1441.1558 1453.2898 1460.8172 1462.2028 1476.9624 1480.0006 1492.2841 2986.4739 2992.2675 2999.7734 3001.4199 3082.6197 3090.5240 3091.8171 3097.7312 3101.2876 3112.8124 3135.8000 3494.4262
redmass: 3.7949 3.8856 2.3015 1.3586 1.3584 2.1179 1.3150 2.0351 3.7208 2.9379 2.3865 3.1679 3.0143 3.0643 2.0234 3.1368 1.7451 3.4802 4.1243 2.0180 1.7035 1.6037 1.2138 5.4812 1.7724 1.3949 1.7668 3.4841 2.1496 3.0686 3.3659 1.7789 4.6355 1.4579 1.1951 1.1925 1.1559 1.1874 1.0795 1.0508 1.0468 1.0468 1.0557 1.0584 1.0599 1.0352 1.0354 1.0637 1.0393 1.0994 1.1000 1.1007 1.1002 1.0996 1.1000 1.0961 1.0646
irintensity: 0.7137 7.7925 4.1473 2.1169 1.7742 2.8386 0.4926 0.1905 6.3288 1.8082 2.9629 6.5633 0.8055 1.2317 67.2205 9.1343 124.6407 6.8560 27.7275 31.7084 0.8701 10.0690 0.6290 100.9884 67.7887 3.3340 87.7830 90.9021 82.3805 23.5912 23.4973 32.5516 62.0500 31.4568 16.0553 28.7352 18.8908 16.1267 6.4702 0.7451 0.5037 1.6264 11.3679 15.8466 21.1250 16.7265 17.9097 39.1472 14.3147 14.8306 28.4647 7.4451 21.1860 56.4949 26.3238 14.2180 12.4040
temp: 298.150 k
press: 1.00000 atm
elementType: 8 8 7 7 6 6 6 6 6 1 1 1 1 1 1 1 1 1 1 1 1
symmnumber: 1
zpe: 458104.3 jmol-1
zpe.correction: 0.174483 hartree
zpe.thermalcorrener: 0.185292 hartree
zpe.thermalcorrenthalpy: 0.186237 hartree
zpe.thermalcorrgfe: 0.138830 hartree
zpe.sumelectzpe: -456.860583 hartree
zpe.sumelectthermal: -456.849773 hartree
zpe.sumelectthermalent: -456.848829 hartree
zpe.sumelectthermalfe: -456.896236 hartree
dipole: 3.5721 -1.6533 1.1362
dipole: 4.0968
quadrupole: -56.4457 -62.8044 -53.3541
quadrupole: 1.4092 -1.1041 -2.2204
quadrupole: 1.0890 -5.2697 4.1807 1.4092 -1.1041 -2.2204
hfenergy: -457.0350658 hartree
pointgroup: C01 [X(C5H12N2O2)]
dipole: -1.4222251 0.4739895 0.5920897 debye
dipolederiv: -0.5521943 -0.326443 0.050941 -0.2929196 -0.4928063 -0.0413465 0.1241265 0.1415937 -0.6198994 -1.1626916 0.5287556 0.1317483 -0.1594453 -0.299917 -0.0115809 0.0105302 0.0092839 -0.2409204 -0.6287896 0.0488522 0.0874135 0.4689914 -0.705736 -0.060072 0.2357609 -0.1157833 -0.3787043 0.9865835 -0.7110217 -0.1892257 -0.5923982 0.4447826 0.152403 -0.2281771 0.0947196 -0.0259506 0.715364 -0.0380972 -0.0209201 0.0490943 0.1300106 -0.055125 -0.00744 -0.0367744 0.339994 -0.0671325 0.0294723 0.0137228 0.0069957 -0.0157029 0.0698471 -0.006054 0.0559358 -0.0495715 0.0164926 -0.0299676 -0.0021575 -0.0741662 -0.0756076 -0.0321783 -0.0176778 -0.0328569 0.0088009 -0.0834349 0.0304643 0.0262656 0.0103983 0.0504865 -0.0293441 0.0214159 -0.0170763 -0.083533 0.469704 0.3037354 -0.0922583 0.2239545 0.5784126 -0.0469282 -0.0997977 -0.1160043 0.6117795 0.0855155 -0.0897497 -0.0210447 -0.0753193 -0.1067413 -0.0174133 -0.0235932 -0.0645577 0.0590903 0.0784022 0.0271176 0.0747752 0.0294946 0.061218 -0.0675797 0.0507461 -0.0265814 -0.0973124 -0.1772106 0.0317315 -0.021695 0.0108471 0.0849227 0.0074768 -0.013485 0.0214268 0.0927033 0.0911749 0.0446831 -0.045141 0.0130416 -0.0222566 0.0846655 -0.039671 0.1121028 -0.0234899 0.0791184 0.0288051 0.078349 -0.0016161 0.0608626 -0.0426141 0.0621019 -0.0641267 -0.0809615 -0.1828417 -0.0113204 -0.0173784 0.0490649 0.0863627 0.0011245 -0.0062279 -0.002392 0.0998997 0.0883066 -0.0924703 -0.0294204 -0.0725829 -0.1298882 -0.0866402 -0.0125627 -0.0400729 0.0485801 -0.1693818 0.0116953 0.0094589 -0.0068128 0.099747 -0.0024145 -0.0209241 -0.0126508 0.0823917 0.0877178 0.0496777 -0.0520228 0.0387435 -0.0075592 0.1233839 -0.0248042 0.0803474 -0.048167 -0.0037233 -0.0519322 -0.0885272 0.0271434 0.01682 0.1076139 -0.0352372 0.0367211 -0.084693 0.0191042 0.0802499 0.0808152 0.0878055 0.0034715 -0.0411199 0.0513204 -0.0121844 0.0708407 0.3099168 0.1357623 0.0263015 0.2596856 0.2391181 -0.0121581 -0.0203499 -0.0110702 0.3191229 unknown
polarizability: 92.8448563|-4.5769817|76.3629217|-3.7527224|2.1680491|63.5832205 unknown
InChI: InChI=1S/C5H12N2O2/c1-5(2,3)7(4-8)6-9/h8H,4H2,1-3H3
charge 0 multiplicity 1
21 atoms
O  1.813902 1.788011 -0.631583
O  2.23046 -0.97238 -0.184484
N  0.272785 0.057164 0.15381
N  0.935516 -1.099577 -0.188364
C  -1.232158 0.082468 0.052553
C  -1.627923 1.109763 -1.042883
C  -1.755784 -1.32194 -0.328367
C  -1.816538 0.49346 1.431609
C  1.079131 1.260759 0.500045
H  -1.229268 2.116814 -0.828997
H  -1.242524 0.794731 -2.027611
H  -2.729026 1.179492 -1.099891
H  -1.478446 -2.078634 0.424055
H  -1.36014 -1.655107 -1.30123
H  -2.85766 -1.271904 -0.392383
H  -1.501858 1.507327 1.738435
H  -2.919479 0.492771 1.37582
H  -1.508597 -0.222213 2.214073
H  1.759895 0.96596 1.322844
H  0.399432 2.057632 0.828088
H  2.519682 1.118403 -0.843842
