program: Gaussian 09
title: 000190048
version: EM64L-G09RevD.01
frameworkgroup: C1[X(C12H8Cl2O)]
method: RPBEPBE
basis: SDD
operation: Freq
keyword: #p
keyword: freq=noraman
keyword: PBEPBE/SDD
title: #p freq=noraman PBEPBE/SDD
converged: YES YES NO NO
title: Mulliken charges:
elementType: Cl Cl O C C C C C C C C C C C C H H H H H H H H
charge: -0.063430 -0.062982 -0.433336 0.408611 0.356170 -0.535072 -0.392089 -0.340876 -0.393708 0.329973 -0.059169 -0.414333 -0.107385 -0.216328 -0.242031 0.268900 0.269322 0.268286 0.248026 0.254626 0.234867 0.260349 0.361610
chargesum: 0.00000
title: Mulliken charges with hydrogens summed into heavy atoms:
elementType: Cl Cl O C C C C C C C C C C C C
charge: -0.063430 -0.062982 -0.071726 0.408611 0.356170 -0.266172 -0.122766 -0.072591 -0.145682 0.329973 -0.059169 -0.159708 -0.107385 0.018540 0.018318
polarizability: 2.34122129e+02 5.17162666e-01 1.69848356e+02 6.20858083e+00 -5.60298001e+00 6.76295218e+01
1716.lowfreq: -7.2985 -3.8772 -0.0030 -0.0026 -0.0017 3.8001 34.0746 72.4718 75.8082
frequency: 34.0464 72.4683 75.8033 173.4943 182.9578 203.1386 208.1312 229.6349 247.2804 305.0173 347.0201 356.3014 395.4625 406.1878 430.9628 473.5121 515.4903 542.5625 557.6568 609.5958 630.8543 680.9518 688.2542 696.0545 789.6676 807.4912 825.5796 858.7862 880.5553 891.3029 905.3844 913.6834 976.7958 979.4900 984.7202 1060.7700 1077.9940 1095.4852 1102.0153 1147.2343 1182.0094 1207.5596 1272.7588 1282.9456 1311.5293 1364.1483 1377.8470 1414.5726 1437.8499 1458.6980 1487.9672 1563.0583 1577.4102 1606.8219 1625.2190 3139.2466 3149.5831 3157.9419 3164.2522 3171.4341 3174.6952 3178.3509 3585.7160
redmass: 8.2618 7.2211 7.6313 7.5473 5.3606 7.4057 8.1006 4.1272 4.5813 7.8245 5.9523 1.1245 10.2755 7.1371 3.1698 4.1408 6.8744 5.1013 4.8109 4.1472 7.4805 2.9014 4.5219 2.1124 1.4340 8.2795 1.5273 1.4742 1.4440 1.5216 1.8211 3.5849 1.6724 3.8046 4.4771 2.7319 1.8298 1.5689 1.6266 1.3263 1.0946 1.7707 1.2516 1.4201 2.7948 4.9919 8.4502 3.3280 3.2182 2.6871 3.3076 5.9268 7.2162 6.7404 6.7789 1.0870 1.0931 1.0938 1.0925 1.0915 1.0930 1.0979 1.0662
irintensity: 0.0885 0.7261 0.4068 0.4591 0.0883 1.8390 1.3000 0.8438 1.5243 5.3023 0.7109 144.0219 7.2119 8.8552 1.1001 12.0817 1.3326 2.9733 1.8509 4.0240 7.8664 26.9108 55.5894 12.4852 62.7365 74.4785 32.7515 28.8383 19.2612 2.3451 7.5302 22.8391 1.7782 1.7277 8.2442 54.1291 11.6105 11.2110 44.2356 194.0114 0.8788 12.7153 18.2004 3.3917 18.5144 7.6501 20.9551 13.9429 59.1220 38.0456 0.1713 177.3565 56.7817 31.1131 130.0654 6.9352 2.6869 9.4325 1.3347 0.9035 0.3031 6.4369 50.7058
temp: 298.150 k
press: 1.00000 atm
elementType: 17 17 8 6 6 6 6 6 6 6 6 6 6 6 6 1 1 1 1 1 1 1 1
symmnumber: 1
zpe: 426178.1 jmol-1
zpe.correction: 0.162323 hartree
zpe.thermalcorrener: 0.175294 hartree
zpe.thermalcorrenthalpy: 0.176239 hartree
zpe.thermalcorrgfe: 0.121588 hartree
zpe.sumelectzpe: -1456.382604 hartree
zpe.sumelectthermal: -1456.369632 hartree
zpe.sumelectthermalent: -1456.368688 hartree
zpe.sumelectthermalfe: -1456.423338 hartree
dipole: -1.6201 -2.4679 0.3314
dipole: 2.9707
quadrupole: -87.4117 -100.9968 -104.3711
quadrupole: -0.7327 5.8034 -2.5326
quadrupole: 10.1815 -3.4036 -6.7779 -0.7327 5.8034 -2.5326
hfenergy: -1456.5449267 hartree
pointgroup: C01 [X(C12H8Cl2O1)]
dipole: 0.6393917 -0.9665214 -0.1516984 debye
dipolederiv: -0.3144229 -0.2573173 0.0463961 -0.3514762 -0.6630247 0.12026 0.0669554 0.1194861 -0.0984716 -0.4711768 0.2825435 0.1173479 0.4115853 -0.4736639 -0.1663563 0.1649813 -0.160048 -0.1407739 -0.701962 0.6274835 -0.1465823 0.7684064 -0.9179521 0.1567509 -0.1859194 0.153404 -0.467604 0.4414864 -0.0576903 0.0319891 0.1362988 0.2805516 -0.0887226 0.0020307 -0.0587631 0.0297406 0.3456519 0.0517107 0.005145 -0.0273432 0.0598321 0.0506494 -0.0065395 0.0168685 0.020022 -0.4848641 0.2936455 -0.0819409 0.0142506 -0.1302289 -0.0246013 -0.0693947 -0.0086613 -0.1765159 -0.4869619 -0.2005802 0.0419732 -0.2180609 -0.3742526 0.0244441 0.0789839 0.0320829 -0.1544826 -0.3689914 0.1280651 0.0644839 0.1454142 -0.1625487 -0.0066193 0.1168682 -0.0107381 -0.1099408 -0.217751 -0.0765005 -0.0393238 -0.0675169 -0.0598511 0.0547011 -0.0785756 0.0463393 -0.1294312 0.8522791 -0.5539913 0.1578251 -0.7238654 0.8941174 -0.2173694 0.2456943 -0.2059333 0.167376 0.6665826 0.4208012 -0.0585445 0.4273346 1.034203 -0.2222201 -0.0921012 -0.2154884 0.0307797 -0.2735032 -0.1249789 0.0283361 0.1696215 -0.5538872 0.102319 -0.0404706 0.0723616 -0.2109445 0.6583195 -0.4651353 -0.1910976 -0.6680036 0.6848645 0.3006789 -0.2978743 0.2878095 0.0693083 0.0998133 0.0047545 -0.0003955 0.075058 0.0965325 0.0898688 0.0540583 0.0924709 -0.0959233 -0.1821098 0.0940868 0.040453 0.1438326 -0.2515672 -0.05877 0.0592041 -0.0498284 -0.1448972 0.1010358 -0.0688772 0.0111069 -0.0667236 0.0035752 0.0399099 0.0231955 0.0282291 0.1517972 0.0709046 0.0671661 -0.0246005 0.0747889 0.0415206 0.0358443 -0.0358253 0.0274834 0.1512438 0.1065298 -0.0552581 -0.0230768 -0.0640599 0.0179606 -0.0559386 -0.0368662 -0.0460901 0.1292503 0.0383572 0.0977223 0.0432146 0.0879905 0.0228772 -0.0582214 0.0520725 -0.0447305 0.1240849 -0.0592474 0.0107933 -0.0167512 0.0158969 0.0929991 0.0226938 -0.0183592 0.0178865 0.1820246 0.029429 -0.0533397 -0.0193561 -0.0736872 -0.0508945 -0.0813212 -0.02589 -0.0830145 0.1243722 -0.047947 -0.0169972 -0.004431 -0.0034235 0.1121518 -0.0235782 -0.004293 -0.0199323 0.1619674 0.1985483 -0.1481064 0.0178292 -0.2063179 0.296685 0.0055979 0.0280645 0.0088062 0.3870181 unknown
polarizability: 234.3416484|0.2985937|169.9297619|-1.4231499|4.8115042|67.3285967 unknown
InChI: InChI=1S/C12H8Cl2O/c13-10-3-1-2-8(4-10)9-5-11(14)7-12(15)6-9/h1-7,15H
charge 0 multiplicity 1
23 atoms
Cl 3.253507 2.917888 -0.543463
Cl -4.287946 1.935111 0.790789
O  3.53673 -2.201512 0.591876
C  0.533906 -0.128174 -0.040768
C  -0.947198 -0.302607 -0.095203
C  1.377388 -1.229473 0.246135
C  1.115236 1.150216 -0.279014
C  -1.810354 0.751828 0.311656
C  -1.526619 -1.517417 -0.553266
C  2.777884 -1.060477 0.292482
C  2.510863 1.281378 -0.223367
C  3.371258 0.204076 0.057583
C  -3.201875 0.568914 0.251503
C  -2.927351 -1.675858 -0.602126
C  -3.788623 -0.629204 -0.198266
H  0.966489 -2.217459 0.470613
H  0.492896 2.010163 -0.53878
H  -1.400255 1.68817 0.700943
H  -0.879251 -2.329069 -0.900909
H  4.456576 0.347359 0.092685
H  -3.358525 -2.614461 -0.965769
H  -4.875717 -0.741626 -0.233613
H  4.503786 -1.994967 0.618979
