program: Gaussian 09
title: 000190046
version: EM64L-G09RevD.01
frameworkgroup: C1[X(C9H16N2O5)]
method: RPBEPBE
basis: SDD
operation: Freq
keyword: #p
keyword: freq=noraman
keyword: PBEPBE/SDD
title: #p freq=noraman PBEPBE/SDD
converged: YES YES NO NO
title: Mulliken charges:
elementType: O O O O O N N C C C C C C C C C H H H H H H H H H H H H H H H H
charge: -0.255779 -0.264483 -0.239072 -0.275358 -0.236169 -0.069127 0.054712 -0.404869 -0.350480 -0.376005 -0.489796 -0.285041 0.244821 0.296012 -0.503329 -0.750189 0.252185 0.213711 0.226622 0.253043 0.228783 0.277177 0.233795 0.261222 0.231382 0.253166 0.235956 0.245085 0.241122 0.253073 0.249030 0.248802
chargesum: 0.00000
title: Mulliken charges with hydrogens summed into heavy atoms:
elementType: O O O O O N N C C C C C C C C C
charge: -0.255779 -0.264483 -0.239072 -0.275358 -0.236169 -0.069127 0.054712 0.061027 0.129184 0.129955 0.005221 0.199507 0.244821 0.296012 0.218834 0.000715
polarizability: 1.66445623e+02 8.60764324e+00 1.25026435e+02 4.35581802e-01 -8.19972767e+00 1.02320036e+02
1716.lowfreq: -46.3116 -9.2645 -5.3368 -0.0013 -0.0013 -0.0009 3.7200 15.9491 20.0105
frequency: -46.2481 15.9235 19.9456 23.9927 37.7292 51.7219 64.6925 76.1232 84.4502 95.3727 101.9324 128.2295 183.3482 225.0763 238.5927 273.8559 276.7187 299.3617 321.6544 346.9227 388.9532 404.3987 448.2238 503.4625 566.5516 577.5186 614.3940 663.5983 683.8770 743.3504 772.0783 803.3137 817.0787 842.1664 868.5171 954.3705 957.0008 975.7247 1001.6858 1040.3032 1043.5090 1050.3377 1060.3080 1069.8213 1113.0544 1116.6753 1148.7251 1155.4655 1180.6908 1193.4754 1237.1083 1258.9882 1260.0005 1290.1918 1304.2480 1316.5205 1337.2322 1346.2795 1353.0257 1367.6875 1380.2761 1385.9410 1422.5952 1437.1684 1445.7352 1451.9724 1452.5486 1453.1205 1454.9941 1463.8016 1467.1254 1477.6260 1645.5225 1659.9371 2977.2492 2987.0286 3001.5331 3006.1483 3007.6245 3020.2578 3036.3826 3050.3160 3062.2738 3086.2933 3091.2902 3100.1536 3108.5621 3120.4210 3142.6849 3151.8640
redmass: 1.0160 6.7513 7.6342 5.0709 3.4932 4.5538 4.2586 3.2796 4.0647 1.0797 2.6554 4.0460 3.4087 4.4211 3.4090 3.0205 4.2571 4.8505 5.5340 3.8638 2.9878 4.5689 4.1490 4.2455 3.2453 3.3239 4.4891 4.5236 2.5659 1.4379 2.3116 1.6503 5.5527 1.9120 3.9475 5.8407 4.2059 3.0861 2.2923 4.3348 1.6703 4.2135 1.8959 3.0627 1.2701 1.7684 1.4399 2.5690 1.7856 3.4758 1.7935 1.3831 1.5201 1.2156 1.2221 1.5066 2.0312 1.5159 1.6646 1.4656 1.3043 1.2781 1.1918 1.1003 1.0805 1.0820 1.0588 1.0499 1.0577 1.0504 1.0874 1.0874 9.0504 9.2261 1.0660 1.0589 1.0631 1.0295 1.0382 1.0598 1.0579 1.1000 1.0956 1.0996 1.1040 1.0945 1.1046 1.1083 1.1022 1.1049
irintensity: 0.3999 1.2756 0.9417 3.2424 0.6986 0.1738 0.8917 4.2491 0.7542 0.3303 0.5752 3.9275 9.2077 2.5089 5.5051 2.3896 15.4104 21.9988 10.4708 3.5380 4.3954 6.2811 7.7179 6.8783 4.1504 8.1093 3.2866 2.8844 1.5421 19.4831 28.0814 3.0057 18.8886 5.5270 20.7638 30.1339 43.3462 120.5854 121.7203 11.8076 16.4027 2.2853 0.5507 5.5205 0.3343 152.3823 2.9628 146.2430 68.8487 312.4209 3.6767 66.4958 24.6848 16.2583 18.8198 20.0124 59.8233 16.2805 44.4736 2.3575 16.8022 41.4297 21.9652 7.8417 19.6596 9.4414 23.6366 15.0660 14.7706 12.3834 21.4761 20.7981 161.7115 165.5366 9.6375 17.9031 22.9627 31.2345 1.7424 19.4927 31.2036 5.0087 0.9625 0.6189 24.7395 7.5915 26.1333 11.8585 7.8996 15.8714
temp: 298.150 k
press: 1.00000 atm
elementType: 8 8 8 8 8 7 7 6 6 6 6 6 6 6 6 6 1 1 1 1 1 1 1 1 1 1 1 1 1 1 1 1
symmnumber: 1
zpe: 665386.9 jmol-1
zpe.correction: 0.253432 hartree
zpe.thermalcorrener: 0.271814 hartree
zpe.thermalcorrenthalpy: 0.272758 hartree
zpe.thermalcorrgfe: 0.201617 hartree
zpe.sumelectzpe: -836.845335 hartree
zpe.sumelectthermal: -836.826954 hartree
zpe.sumelectthermalent: -836.826010 hartree
zpe.sumelectthermalfe: -836.897150 hartree
dipole: 1.1453 -3.7047 4.3813
dipole: 5.8508
quadrupole: -73.9959 -108.7807 -96.9269
quadrupole: 4.9227 -8.5430 5.2348
quadrupole: 19.2386 -15.5462 -3.6924 4.9227 -8.5430 5.2348
hfenergy: -837.0987674 hartree
pointgroup: C01 [X(C9H16N2O5)]
dipole: 0.4244787 2.2244471 0.4127059 debye
polarizability: 166.7167319|-3.6184417|114.9488821|-7.0682723|13.8204436|112.1264801 unknown
InChI: InChI=1S/C9H16N2O5/c1-8(12)16-7-6-11(10-14)5-3-4-9(13)15-2/h3-7H2,1-2H3
charge 0 multiplicity 1
32 atoms
O  -3.20281 1.101386 0.706948
O  5.107947 0.603123 0.27853
O  3.339251 0.312692 1.765492
O  0.334967 -2.18834 -2.628949
O  -4.466242 -0.862661 0.690865
N  -0.686322 -0.431538 -1.669901
N  -0.782437 -1.714669 -2.19931
C  0.593474 0.312344 -1.675431
C  1.533861 -0.067263 -0.506361
C  -1.953103 0.151207 -1.204492
C  2.894743 0.645546 -0.649416
C  -1.996995 0.317389 0.331763
C  3.752906 0.491704 0.597213
C  -4.396777 0.371457 0.872787
C  6.047966 0.512717 1.424479
C  -5.512729 1.287651 1.319043
H  1.095322 0.076745 -2.634503
H  0.354625 1.391698 -1.653803
H  1.083215 0.202644 0.465366
H  1.683962 -1.161076 -0.505503
H  -2.107109 1.139673 -1.677977
H  -2.757588 -0.530742 -1.526537
H  2.74333 1.733965 -0.807982
H  3.4603 0.277131 -1.522849
H  -1.158343 0.924427 0.707118
H  -2.018081 -0.668029 0.828907
H  7.045029 0.630276 0.978209
H  5.946501 -0.466006 1.922305
H  5.839405 1.3132 2.154009
H  -5.43105 1.461812 2.407528
H  -6.484837 0.816421 1.112289
H  -5.44208 2.266018 0.81816
