program: Gaussian 09
title: 000189996
version: EM64L-G09RevD.01
frameworkgroup: C1[X(C12H12FN3O2)]
method: RPBEPBE
basis: SDD
operation: Freq
keyword: #p
keyword: freq=noraman
keyword: PBEPBE/SDD
title: #p freq=noraman PBEPBE/SDD
converged: NO NO NO NO
title: Mulliken charges:
elementType: F O O N N N C C C C C C C C C C C C H H H H H H H H H H H H
charge: -0.209002 -0.260615 -0.260613 -0.120249 -0.120246 -0.372570 -0.358186 -0.358183 -0.403709 -0.403710 0.249399 0.249396 0.453007 -0.320138 -0.320143 -0.379472 -0.379469 0.328888 0.259232 0.229723 0.259233 0.229722 0.216910 0.228407 0.216911 0.228407 0.302125 0.302125 0.256410 0.256410
chargesum: 0.00000
title: Mulliken charges with hydrogens summed into heavy atoms:
elementType: F O O N N N C C C C C C C C C C C C
charge: -0.209002 -0.260615 -0.260613 -0.120249 -0.120246 -0.372570 0.130769 0.130772 0.041609 0.041608 0.249399 0.249396 0.453007 -0.018014 -0.018018 -0.123062 -0.123060 0.328888
polarizability: 2.30212721e+02 2.66243805e-04 1.55102766e+02 -3.70752110e-04 4.94406103e+00 8.09904871e+01
1716.lowfreq: -8.7412 -4.9064 -4.8164 0.0004 0.0008 0.0013 14.6117 37.3233 89.7624
frequency: 14.4940 37.3122 89.7618 109.1828 113.0540 139.2957 207.0186 246.0256 254.2428 260.2805 284.9474 302.4030 342.0872 363.7669 386.3094 410.6285 411.2525 462.3077 468.7487 516.8818 564.8271 580.1122 627.9997 628.3739 653.2143 700.0985 719.1487 731.7497 761.1175 812.4668 816.5707 825.6916 839.5438 868.0854 889.6708 912.6957 951.4042 963.6871 965.9531 1004.7973 1043.2530 1048.9603 1082.0261 1089.8092 1120.1625 1124.8340 1146.4086 1159.0508 1168.6428 1207.9774 1243.0981 1254.9406 1276.2577 1304.5186 1305.0649 1333.8546 1344.2583 1350.9349 1353.1859 1364.0861 1365.0294 1377.2068 1418.5120 1458.9170 1460.9109 1473.0611 1477.0653 1500.5339 1599.5236 1617.3505 1634.0823 1687.0383 2963.5813 2964.3612 3001.3246 3002.5977 3067.3912 3074.8164 3091.7891 3092.7047 3172.4702 3172.5400 3195.6218 3197.4929
redmass: 4.0476 5.9567 5.9191 3.3076 6.9655 8.4040 2.9072 5.0261 7.3556 5.6548 2.6667 10.1409 7.3999 2.7171 6.8520 5.4422 3.0737 2.3898 5.5475 2.6744 7.4871 2.9996 6.7990 7.5580 11.4939 5.6860 5.1702 5.3623 5.9705 2.2863 1.8189 1.5181 1.5936 2.5829 3.1611 1.4631 1.3434 1.3334 2.2142 3.2729 3.7662 7.2400 1.5144 3.1380 2.0699 1.3267 2.6352 1.7609 1.4156 1.6718 1.6912 1.3498 1.9418 4.2194 1.2896 1.3090 1.4857 5.0626 1.4089 1.5096 4.0311 8.7889 3.3789 1.0872 1.0914 1.0822 1.0858 2.6052 7.8444 6.1550 11.1517 11.8387 1.0695 1.0691 1.0646 1.0597 1.0993 1.1015 1.0946 1.0962 1.0904 1.0909 1.0951 1.0967
irintensity: 0.2470 1.9016 0.8162 1.6136 1.5737 5.6841 0.5784 5.8238 0.1343 1.2559 11.6185 2.0150 33.9112 19.5291 0.2729 2.1274 0.4946 4.9370 0.0714 28.2292 49.2961 10.0269 0.3062 0.3229 15.7609 6.3939 2.0513 7.1471 6.4523 18.5189 9.4552 4.3688 102.7483 3.1997 12.2585 2.3469 4.5530 0.3583 8.6779 17.2146 4.1706 39.9614 0.0070 11.6659 12.7576 30.2199 2.5394 78.0757 0.6981 8.6303 110.9993 5.1730 110.8300 165.9557 10.8334 0.4956 29.6030 356.7084 0.9132 21.4215 6.5002 3.1551 13.5520 12.3277 13.6818 21.2762 2.0590 325.8366 21.0710 0.0990 528.3566 115.6817 61.7455 21.8344 24.0827 34.5964 36.1384 37.5841 0.1452 18.0048 1.3349 2.7274 1.3651 13.0072
temp: 298.150 k
press: 1.00000 atm
elementType: 9 8 8 7 7 7 6 6 6 6 6 6 6 6 6 6 6 6 1 1 1 1 1 1 1 1 1 1 1 1
symmnumber: 1
zpe: 601867.9 jmol-1
zpe.correction: 0.229239 hartree
zpe.thermalcorrener: 0.244101 hartree
zpe.thermalcorrenthalpy: 0.245045 hartree
zpe.thermalcorrgfe: 0.185860 hartree
zpe.sumelectzpe: -877.733064 hartree
zpe.sumelectthermal: -877.718202 hartree
zpe.sumelectthermalent: -877.717258 hartree
zpe.sumelectthermalfe: -877.776444 hartree
dipole: 7.0445 0.0000 0.0000
dipole: 7.0445
quadrupole: -92.0226 -110.9289 -103.8771
quadrupole: 0.0000 0.0004 2.0864
quadrupole: 10.2536 -8.6527 -1.6010 0.0000 0.0004 2.0864
hfenergy: -877.9623034 hartree
pointgroup: C01 [X(C12H12F1N3O2)]
dipole: 2.7715035 0.0002816 -0.0002589 debye
polarizability: 230.2127182|0.0089306|154.2725541|-0.0160813|9.2349036|81.8207018 unknown
InChI: InChI=1S/C12H12FN3O2/c13-9-3-5-10(6-4-9)16-11(17)14-7-1-2-8-15(14)12(16)18/h3-6H,1-2,7-8H2
charge 0 multiplicity 1
30 atoms
F  -5.646054 -0.000517 0.000465
O  0.478172 -2.390666 -0.02695
O  0.4777 2.390892 0.02649
N  2.138696 -0.707795 -0.098969
N  2.138571 0.708349 0.09819
N  0.002546 0.000065 -0.000199
C  3.331605 -1.458663 0.332419
C  3.331275 1.459454 -0.333347
C  4.59406 -0.748239 -0.20161
C  4.593942 0.749277 0.200512
C  0.823867 -1.179088 -0.046698
C  0.823643 1.179383 0.046094
C  -1.437456 -0.000082 -0.000029
C  -2.147632 -1.172882 -0.372078
C  -2.147787 1.172572 0.372188
C  -3.557425 -1.173724 -0.368935
C  -3.557581 1.173123 0.369374
C  -4.233073 -0.00037 0.000299
H  3.224974 -2.481459 -0.063176
H  3.360471 -1.513961 1.440868
H  3.224493 2.482228 0.062264
H  3.359985 1.51476 -1.4418
H  4.627454 -0.839421 -1.304155
H  5.487705 -1.255329 0.203505
H  4.627468 0.840466 1.303052
H  5.487433 1.256542 -0.204725
H  -1.602857 -2.080694 -0.635718
H  -1.603137 2.080496 0.635701
H  -4.120142 -2.068828 -0.647927
H  -4.120417 2.068112 0.648498
