program: Gaussian 09
title: 000017518
version: EM64L-G09RevD.01
frameworkgroup: C1[X(C6Cl3N3O6)]
method: RPBEPBE
basis: SDD
operation: Freq
keyword: #p
keyword: freq=noraman
keyword: PBEPBE/SDD
title: #p freq=noraman PBEPBE/SDD
converged: YES YES NO NO
title: Mulliken charges:
elementType: Cl Cl Cl O O O O O O N N N C C C C C C
charge: 0.122609 0.122679 0.122563 -0.126098 -0.125923 -0.125811 -0.125958 -0.126122 -0.126066 -0.020856 -0.020951 -0.020934 0.832471 0.832939 0.831730 -0.682975 -0.681373 -0.681923
chargesum: 0.00000
title: Mulliken charges with hydrogens summed into heavy atoms:
polarizability: 1.71661871e+02 5.90227100e-03 1.71547723e+02 -3.15251471e-01 -2.14529299e-02 1.00585193e+02
1716.lowfreq: -5.7739 -0.0017 0.0009 0.0024 2.0424 4.7423 11.9432 20.0973 22.5373
frequency: 11.6429 19.9715 22.3279 57.6284 57.9207 70.9136 118.0936 131.4030 131.6673 154.8198 178.8975 179.1346 203.1458 203.2634 283.0438 283.1099 289.6649 358.8442 421.0684 444.8339 445.0003 457.4357 543.4873 543.6633 667.1053 668.2473 673.6574 674.9445 702.2370 734.1418 749.9154 750.0985 774.7174 891.2835 891.3658 1086.9650 1193.7614 1217.8875 1218.1156 1241.0576 1345.7029 1346.0728 1366.5238 1404.1665 1404.3387 1408.6153 1561.6183 1562.1820
redmass: 16.0140 16.0736 16.1067 22.5153 22.5048 17.8642 17.9119 16.4663 16.4587 22.3100 26.8698 26.8809 14.6273 14.6244 20.6392 20.6625 15.6240 32.3001 13.8787 12.8369 12.8411 13.5969 14.8986 14.9012 13.5077 13.6091 12.8963 12.9930 12.1379 15.1629 14.2341 14.2311 13.1137 13.1477 13.1478 12.4605 12.9725 14.7900 14.7882 13.6138 12.0599 12.0590 12.0063 14.6464 14.6467 14.6474 12.0108 12.0108
irintensity: 0.0007 0.0034 0.0081 0.0024 0.0003 3.4552 0.5237 2.8135 2.8174 0.0012 0.0000 0.0001 0.0012 0.0021 0.3287 0.3252 0.0005 0.0001 5.4805 0.0037 0.0173 0.3023 39.4854 39.6002 19.4526 20.2405 8.8070 9.7229 1.9639 0.0004 0.3495 0.3692 0.0017 50.6355 50.5794 0.0005 0.0002 175.2183 175.6648 0.0153 34.1378 34.2023 0.0096 0.7586 0.4552 455.8956 37.1001 37.2704
temp: 298.150 k
press: 1.00000 atm
elementType: 17 17 17 8 8 8 8 8 8 7 7 7 6 6 6 6 6 6
symmnumber: 1
zpe: 186292.7 jmol-1
zpe.correction: 0.070955 hartree
zpe.thermalcorrener: 0.088298 hartree
zpe.thermalcorrenthalpy: 0.089242 hartree
zpe.thermalcorrgfe: 0.020396 hartree
zpe.sumelectzpe: -2222.798493 hartree
zpe.sumelectthermal: -2222.781151 hartree
zpe.sumelectthermalent: -2222.780207 hartree
zpe.sumelectthermalfe: -2222.849052 hartree
dipole: 0.0039 -0.0038 -0.0037
dipole: 0.0066
quadrupole: -131.1405 -131.0988 -128.7999
quadrupole: 0.0042 0.0963 -0.0246
quadrupole: -0.7941 -0.7524 1.5465 0.0042 0.0963 -0.0246
hfenergy: -2222.8694482 hartree
pointgroup: C01 [X(C6Cl3N3O6)]
dipole: 0.0018196 -0.0012605 0.0013543 debye
dipolederiv: -0.5634528 0.0389427 0.0561581 0.0384803 -0.0164201 0.0012458 0.0567016 0.0044616 0.0547562 -0.122476 0.2204255 0.0058942 0.2205029 -0.4628606 0.0029198 0.0032107 0.0018995 0.0599688 -0.1835158 -0.2549725 0.034612 -0.2544922 -0.3971585 0.0435117 0.0363738 0.0418788 0.0549584 -0.3062855 -0.2172796 -0.1306339 -0.2271676 -0.4559867 -0.1106254 -0.0475672 0.0066258 -0.6019761 -0.2338927 0.1748251 -0.0971711 0.1871682 -0.5080554 0.136121 -0.0368819 0.0055461 -0.6210763 -0.5796623 0.0405866 0.1585896 0.0316044 -0.1482564 -0.0490516 0.0147033 -0.038014 -0.6359551 -0.2725844 -0.2023463 0.0481625 -0.1925571 -0.4568881 0.1613398 -0.028924 0.0394795 -0.6340555 -0.2308363 0.1846527 0.0479606 0.1725053 -0.5123059 -0.1596572 -0.0180646 -0.0321348 -0.6207745 -0.6141679 0.0156077 -0.1664327 0.0249762 -0.1459229 -0.0255383 -0.0228428 -0.0332607 -0.6041716 0.4429843 0.5342828 0.0946427 0.5340656 0.8707127 -0.0648202 0.0835098 -0.0572788 1.2113748 0.3002099 -0.4571437 0.0598378 -0.4572791 1.0065963 0.0286924 0.0715078 0.0337907 1.2165409 1.2262117 -0.0724405 0.0038431 -0.0723952 0.082289 0.0887592 0.0029523 0.0817818 1.2158504 -0.2208869 0.1321693 0.0155731 0.1313157 -0.1147098 0.0011446 0.0184514 0.0000957 0.0772102 -0.251157 -0.1107835 0.0415856 -0.1102944 -0.0805846 0.0205757 0.0384817 0.0195433 0.0732692 -0.0237358 -0.0182115 0.0104924 -0.0180829 -0.3082985 0.0157977 0.0114388 0.017769 0.0767016 0.9539521 -0.0606042 -0.0968579 -0.0577311 0.1371374 -0.0050425 -0.0994646 -0.0272979 -0.1039497 0.2947626 -0.3291071 -0.0237418 -0.3299527 0.8041707 -0.0124363 -0.0084846 -0.0027079 -0.1133826 0.384533 0.3813963 -0.0625144 0.3793339 0.7065415 -0.0729362 -0.0751016 -0.0621775 -0.1052891 unknown
polarizability: 170.9708966|-0.3385203|171.4749459|-6.3655004|-3.6344556|101.3489444 unknown
InChI: InChI=1S/C6Cl3N3O6/c7-1-4(10(13)14)2(8)6(12(17)18)3(9)5(1)11(15)16
charge 0 multiplicity 1
18 atoms
Cl 3.188251 -0.220784 -0.283698
Cl -1.414088 2.87849 -0.005628
Cl -1.770699 -2.659253 0.286985
O  2.071278 2.893191 0.830346
O  1.584651 -3.086582 1.149171
O  -3.344299 0.32369 1.438616
O  1.758552 2.860547 -1.440924
O  1.475586 -3.141229 -1.140631
O  -3.551606 0.15338 -0.83843
N  1.598425 2.39982 -0.254905
N  1.277094 -2.59798 0.004085
N  -2.876648 0.198696 0.25122
C  0.774851 1.160735 -0.123908
C  0.618861 -1.257435 0.002756
C  -1.392134 0.095796 0.123114
C  1.407629 -0.097466 -0.123747
C  -0.624123 1.269811 -0.002036
C  -0.781481 -1.173429 0.127612
