program: Gaussian 09
title: 000189966
version: EM64L-G09RevD.01
frameworkgroup: C1[X(C18H12BrN)]
method: RPBEPBE
basis: SDD
operation: Freq
keyword: #p
keyword: freq=noraman
keyword: PBEPBE/SDD
title: #p freq=noraman PBEPBE/SDD
converged: YES YES NO NO
title: Mulliken charges:
elementType: Br N C C C C C C C C C C C C C C C C C C H H H H H H H H H H H H
charge: -0.034190 -0.021617 0.207168 0.349083 0.194679 -0.134894 0.277610 0.400763 -0.103022 -0.340239 -0.461206 -0.969683 -0.336998 -0.361331 -0.450168 -0.311638 -0.275759 -0.245320 -0.268087 -0.232507 0.271941 0.244220 0.308971 0.329705 0.256531 0.254821 0.244232 0.267777 0.236654 0.234412 0.232340 0.235753
chargesum: 0.00000
title: Mulliken charges with hydrogens summed into heavy atoms:
elementType: Br N C C C C C C C C C C C C C C C C C C
charge: -0.034190 -0.021617 0.207168 0.349083 0.194679 -0.134894 0.277610 0.400763 -0.103022 -0.068298 -0.216986 -0.331008 -0.080467 -0.106510 -0.205935 -0.043861 -0.039106 -0.010908 -0.035747 0.003246
polarizability: 3.93844628e+02 -1.47776847e+01 2.58106771e+02 -2.51634911e+00 2.04242697e+00 9.44028004e+01
1716.lowfreq: -3.7868 -2.0906 -0.0004 0.0003 0.0007 7.3975 42.4798 67.8945 74.6286
frequency: 42.4389 67.8855 74.6286 89.1011 124.2290 157.9369 185.5975 203.4006 271.3984 288.0539 331.7190 352.5297 368.7374 406.8500 431.3828 454.1861 479.9560 507.8738 517.7523 531.7876 541.1222 567.1918 569.7784 576.1944 635.4725 656.2297 670.3458 707.0766 746.9169 761.8723 768.6610 772.6297 780.7347 817.7961 842.9452 848.2597 874.6182 880.4282 895.6505 921.0252 966.9889 970.6845 983.8105 994.3662 996.2447 1001.2667 1025.1104 1040.4917 1056.2276 1099.7581 1131.3905 1136.9690 1149.6717 1175.9181 1182.7564 1224.6919 1227.8241 1239.8416 1254.5821 1285.8154 1307.0106 1315.2518 1332.0383 1366.3584 1394.5012 1401.7533 1423.7749 1438.8144 1452.5566 1468.9521 1488.2726 1499.0347 1533.6339 1545.5818 1557.9005 1611.8340 1615.4063 1633.2280 3081.6279 3126.4954 3133.1437 3134.4409 3140.0686 3147.9727 3159.7687 3161.6960 3163.4559 3172.8987 3174.3248 3174.5598
redmass: 6.2507 6.5816 5.6392 6.6362 5.7775 5.5647 4.4004 5.7980 4.6673 5.1375 5.7511 4.3926 3.3694 3.9908 3.8871 5.4502 4.1130 5.9359 3.3819 5.0702 6.4832 4.7335 3.6120 4.9908 6.0849 4.5322 5.6093 3.5480 4.9801 3.9840 1.3315 1.4495 3.1503 2.5763 3.0401 1.8729 3.5862 1.8797 1.6431 2.2833 1.3729 1.5230 2.6839 1.4884 1.3338 1.3739 2.6890 3.0707 2.1261 1.9882 1.2993 1.5797 1.3042 1.1774 1.1100 1.1770 1.6437 1.7597 2.5239 2.0164 1.9727 4.2031 3.5675 3.9658 7.5165 2.0629 5.7644 2.8611 2.0904 2.1490 1.4288 3.3822 7.9308 6.0586 6.9185 6.0573 6.0215 6.9806 1.0585 1.0872 1.0889 1.0856 1.0899 1.0893 1.0997 1.0976 1.1029 1.0971 1.1000 1.0975
irintensity: 0.6392 0.6481 1.1330 0.4322 2.0144 0.9236 1.2755 0.5965 0.5400 2.9657 4.1997 0.3176 2.6825 2.1651 10.2435 3.8476 30.0401 5.5974 0.8496 39.2767 0.2078 10.6259 5.1744 3.2040 3.7139 4.6572 1.1785 4.3395 4.1287 6.1201 34.2041 99.8858 8.6075 15.3398 15.1433 35.7680 1.9981 2.4342 11.9675 3.4516 2.2104 2.2213 5.5010 1.1592 0.3558 2.0597 8.5868 8.2827 1.8884 6.3147 6.1340 16.4104 7.0447 2.7347 2.0200 43.0568 12.1200 2.1041 5.1863 1.0664 1.5598 2.0285 22.0812 7.1135 1.4271 14.3405 2.8213 1.1591 4.5866 6.0356 20.2269 20.2388 19.7289 1.7360 1.2216 9.1982 0.9495 0.4180 9.2893 1.9131 8.9380 1.8779 17.2387 7.2687 10.8974 20.3698 6.7380 14.0854 39.1672 14.5940
temp: 298.150 k
press: 1.00000 atm
elementType: 35 7 6 6 6 6 6 6 6 6 6 6 6 6 6 6 6 6 6 6 1 1 1 1 1 1 1 1 1 1 1 1
symmnumber: 1
zpe: 640140.7 jmol-1
zpe.correction: 0.243817 hartree
zpe.thermalcorrener: 0.258724 hartree
zpe.thermalcorrenthalpy: 0.259668 hartree
zpe.thermalcorrgfe: 0.200855 hartree
zpe.sumelectzpe: -760.012306 hartree
zpe.sumelectthermal: -759.997399 hartree
zpe.sumelectthermalent: -759.996454 hartree
zpe.sumelectthermalfe: -760.055267 hartree
dipole: -0.8962 -0.0964 1.3594
dipole: 1.6311
quadrupole: -99.2549 -125.8174 -129.3708
quadrupole: 0.9318 0.9480 2.6357
quadrupole: 18.8928 -7.6697 -11.2231 0.9318 0.9480 2.6357
hfenergy: -760.2561223 hartree
pointgroup: C01 [X(C18H12Br1N1)]
dipole: 0.3430188 0.048907 0.5401252 debye
polarizability: 395.3886596|0.0245648|256.282131|4.6097885|6.4101435|94.683409 unknown
InChI: InChI=1S/C18H12BrN/c19-11-15-14-7-3-4-8-16(14)20-17-10-9-12-5-1-2-6-13(12)18(15)17/h1-10H,11H2
charge 0 multiplicity 1
32 atoms
Br -0.48338 -3.752898 -0.523891
N  -1.346995 1.895395 -0.181807
C  0.376594 0.102175 0.074461
C  -0.660724 -0.855104 0.314827
C  1.825506 -0.173782 0.023581
C  -0.049525 1.497199 -0.075474
C  -2.039763 -0.452593 0.163257
C  2.754671 0.931458 0.096785
C  -2.331789 0.940631 -0.121755
C  0.929492 2.566284 -0.052965
C  2.269605 2.297377 0.084948
C  -0.396936 -2.216791 0.876965
C  2.382161 -1.477282 -0.165756
C  -3.147375 -1.360944 0.274528
C  4.158946 0.687627 0.109845
C  -3.690654 1.370563 -0.293372
C  3.770121 -1.695646 -0.170207
C  4.670874 -0.612634 -0.000137
C  -4.459124 -0.917693 0.099497
C  -4.73752 0.458842 -0.18626
H  0.536383 3.584075 -0.124512
H  3.001743 3.111113 0.139957
H  -1.171392 -2.52405 1.592437
H  0.599346 -2.328058 1.320768
H  1.733743 -2.32779 -0.386687
H  -2.968668 -2.426252 0.448004
H  4.83874 1.544601 0.182716
H  -3.858467 2.430941 -0.503757
H  4.153817 -2.709499 -0.326039
H  5.751746 -0.787478 0.008382
H  -5.286134 -1.632466 0.17001
H  -5.773744 0.787182 -0.319649
