program: Gaussian 09
title: 000189951
version: EM64L-G09RevD.01
frameworkgroup: C1[X(C13H23N3OS)]
method: RPBEPBE
basis: SDD
operation: Freq
keyword: #p
keyword: freq=noraman
keyword: PBEPBE/SDD
title: #p freq=noraman PBEPBE/SDD
converged: YES YES NO NO
title: Mulliken charges:
elementType: S O N N N C C C C C C C C C C C C C H H H H H H H H H H H H H H H H H H H H H H H
charge: 0.617370 -0.625963 -0.282352 -0.704963 -0.701162 -0.370689 -0.359089 0.137391 -0.356184 -0.356829 0.442738 0.389391 -0.498838 -0.473598 -0.686377 -0.684530 -0.172464 -0.804996 0.190303 0.221915 0.182382 0.229520 0.223939 0.180294 0.213860 0.188189 0.218843 0.206252 0.213345 0.221448 0.206440 0.212778 0.220863 0.290490 0.298971 0.340421 0.300925 0.333379 0.288751 0.248232 0.259603
chargesum: 0.00000
title: Mulliken charges with hydrogens summed into heavy atoms:
elementType: S O N N N C C C C C C C C C C C C C
charge: 0.617370 -0.625963 -0.282352 -0.065571 -0.066858 0.041529 0.052813 0.137391 0.048049 0.045219 0.442738 0.389391 -0.498838 -0.254755 -0.045332 -0.044449 0.118027 -0.008410
polarizability: 2.44468538e+02 3.37066099e+00 1.74922674e+02 -6.45672205e+00 -2.27271940e+01 1.65267498e+02
1716.lowfreq: -10.9327 -7.7484 0.0016 0.0019 0.0023 6.2449 7.7011 32.2272 42.8779
frequency: -6.3282 32.1502 42.8646 46.8984 58.9205 77.8418 88.8489 102.8054 126.0798 139.8508 173.2162 179.2270 185.4750 205.0595 213.4390 220.0426 225.8814 232.2720 252.9019 281.3674 285.5016 304.3286 325.5602 346.9426 369.7673 375.1506 381.1008 393.1797 476.7051 486.5005 521.1846 531.8552 538.7819 556.7102 590.6905 595.5151 636.1884 682.7144 743.4696 749.1797 778.9495 781.5667 787.0321 813.6298 860.5465 862.3278 877.5370 883.8465 944.8396 957.4110 965.9463 969.3582 979.2855 1019.4083 1040.6157 1043.8963 1083.2900 1096.7718 1101.0364 1115.3486 1141.1050 1154.9691 1199.1584 1221.6923 1241.5938 1256.9192 1282.3345 1291.6166 1293.3824 1298.3151 1302.5213 1342.8863 1351.3427 1361.9763 1367.1861 1386.1863 1387.3105 1388.3073 1416.3413 1427.7080 1448.6340 1456.8975 1462.9632 1472.1260 1474.1551 1476.5455 1477.2310 1484.1821 1485.0740 1490.2421 1579.2566 1585.4738 1608.6017 1621.0623 2927.4018 2946.3870 2965.0167 2971.8192 2973.2444 2973.6598 3006.8816 3011.5495 3011.6874 3034.4243 3036.9381 3068.8993 3069.9484 3075.9973 3076.1200 3110.0928 3135.7977 3153.2205 3163.9999 3530.6562 3553.1656 3683.1519 3698.5494
redmass: 3.2459 3.7216 4.5345 3.8547 3.3582 2.0610 3.0800 1.5664 3.5172 4.2577 1.2126 3.9424 2.8605 1.3517 2.1124 1.4428 3.2102 3.0583 3.2063 4.7888 2.8917 2.5196 3.4246 1.5879 2.1429 1.6901 6.7995 2.2605 1.0292 3.3527 3.8399 1.5639 2.7551 3.5268 4.9653 4.5367 4.4377 4.2767 1.1180 1.1317 5.7517 2.6663 5.6028 2.5410 1.5309 1.3767 1.6750 1.5176 1.2478 1.3436 1.4141 1.8786 2.6195 1.7085 3.0970 2.8072 1.7472 2.1261 2.1581 1.8579 2.1267 1.5369 2.8891 1.6903 1.6382 1.3465 1.2952 1.3209 1.1449 1.3319 1.1847 2.8986 1.3377 1.3641 1.7952 1.4323 3.7272 1.2170 1.0547 1.0667 1.0767 2.0118 1.6538 1.0605 1.0614 1.0437 1.0441 1.0950 1.0846 3.2512 1.6433 4.0680 2.8053 1.3165 1.0649 1.0613 1.0628 1.0550 1.0368 1.0415 1.0964 1.0252 1.0935 1.1022 1.1024 1.1011 1.1012 1.0992 1.0992 1.0875 1.0953 1.1060 1.1068 1.0445 1.0443 1.1031 1.1034
irintensity: 0.4332 0.2317 5.3095 0.5712 0.6672 1.1886 1.6440 0.1127 6.1635 4.5206 0.2225 0.8000 1.6901 0.7126 4.1606 0.9067 2.5831 3.0834 1.5745 4.8784 18.2661 3.4761 10.0597 88.9094 80.4345 79.5976 19.9701 118.4669 48.1954 5.2751 3.6811 94.7493 1.2619 1.7159 1.0433 2.1171 13.4401 0.4490 4.0798 12.5798 9.5095 9.9914 24.1602 63.2289 0.8217 3.4720 19.7289 6.1992 42.9338 12.3408 0.6875 27.9946 10.0056 2.7030 0.4477 0.8810 32.3873 2.5047 0.6776 52.7010 56.8917 5.2775 30.8678 30.5278 1.7152 5.7157 17.6209 3.0723 5.7189 0.8729 7.1068 54.1324 12.1512 4.1403 5.0159 16.5764 2.5528 13.9407 12.5298 21.1253 7.6133 44.1817 34.2126 3.6319 5.1042 12.9237 11.9499 6.5931 18.4129 66.7273 21.9299 43.3127 251.1642 184.6586 45.2056 36.3278 39.6895 59.4988 38.4302 21.5862 11.5445 11.0870 3.8831 11.6677 26.9766 49.3408 100.4778 20.7549 57.9190 6.6283 23.2719 9.0844 6.4880 38.2922 51.2787 40.8234 32.4575
temp: 298.150 k
press: 1.00000 atm
elementType: 16 8 7 7 7 6 6 6 6 6 6 6 6 6 6 6 6 6 1 1 1 1 1 1 1 1 1 1 1 1 1 1 1 1 1 1 1 1 1 1 1
symmnumber: 1
zpe: 904094.0 jmol-1
zpe.correction: 0.344351 hartree
zpe.thermalcorrener: 0.365788 hartree
zpe.thermalcorrenthalpy: 0.366732 hartree
zpe.thermalcorrgfe: 0.294265 hartree
zpe.sumelectzpe: -1145.225517 hartree
zpe.sumelectthermal: -1145.204080 hartree
zpe.sumelectthermalent: -1145.203136 hartree
zpe.sumelectthermalfe: -1145.275603 hartree
dipole: -6.8465 2.4510 -0.4875
dipole: 7.2883
quadrupole: -138.2817 -114.8906 -107.3779
quadrupole: 15.1155 -3.5755 -8.4655
quadrupole: -18.0983 5.2928 12.8055 15.1155 -3.5755 -8.4655
hfenergy: -1145.5698678 hartree
pointgroup: C01 [X(C13H23N3O1S1)]
dipole: -2.7473411 0.6444456 -0.5090099 debye
polarizability: 243.8833436|6.8807777|159.4541309|-5.9271831|-20.8357496|181.3212356 unknown
InChI: InChI=1S/C13H23N3OS/c1-4-8-16(9-5-2)13-10(14)6-7-11(12(13)15)18(3)17/h6-7H,4-5,8-9,14-15H2,1-3H3
charge 0 multiplicity 1
41 atoms
S  3.802096 0.04669 -0.994986
O  5.036366 -0.422744 0.04105
N  -1.518509 0.025955 -0.243493
N  0.746962 0.347234 -1.86638
N  -1.134125 -0.548753 2.540917
C  -2.133561 -1.101128 -0.976354
C  -2.353332 1.197564 0.097442
C  -0.206774 -0.119918 0.325712
C  -2.886664 -2.133165 -0.093177
C  -2.381391 2.296123 -0.997594
C  0.94136 0.030793 -0.520985
C  -0.018222 -0.410581 1.715298
C  2.231435 -0.11868 0.051014
C  1.296157 -0.557132 2.250535
C  -3.535563 -3.253753 -0.934085
C  -3.284165 3.486697 -0.606839
C  2.411852 -0.424189 1.408191
C  3.899128 1.978057 -0.95607
H  -2.840614 -0.696447 -1.732065
H  -1.339944 -1.634126 -1.537354
H  -3.399201 0.873573 0.298526
H  -1.97405 1.642017 1.038223
H  -2.171941 -2.569881 0.630761
H  -3.66974 -1.608144 0.493032
H  -1.344963 2.645427 -1.171177
H  -2.737859 1.851724 -1.949275
H  1.428583 -0.795152 3.312119
H  -4.268571 -2.841863 -1.653722
H  -2.771589 -3.807141 -1.512338
H  -4.064838 -3.98279 -0.29436
H  -4.329112 3.160011 -0.444342
H  -2.931355 3.9610 0.328414
H  -3.292516 4.261494 -1.394511
H  3.440741 -0.558576 1.768371
H  1.48878 0.243999 -2.552811
H  -0.213187 0.491487 -2.174156
H  -1.021495 -0.81384 3.514762
H  -2.060788 -0.584443 2.123998
H  3.981146 2.241922 0.107913
H  2.986655 2.391402 -1.41314
H  4.806313 2.255477 -1.513065
