program: Gaussian 09
title: 000189926
version: EM64L-G09RevD.01
frameworkgroup: C1[X(C9H12N5O4P)]
method: RPBEPBE
basis: SDD
operation: Freq
keyword: #p
keyword: freq=noraman
keyword: PBEPBE/SDD
title: #p freq=noraman PBEPBE/SDD
converged: YES YES NO NO
title: Mulliken charges:
elementType: P O O O O N N N N N C C C C C C C C C H H H H H H H H H H H H
charge: 1.254527 -0.236905 -0.482876 -0.674576 -0.593069 -0.168754 -0.079217 -0.050846 -0.060741 -0.608290 -0.026094 -0.434767 -0.296890 -0.588135 0.150718 -0.226709 -0.102110 0.174563 -0.362187 0.289752 0.231882 0.271933 0.246470 0.225296 0.288743 0.262271 0.271556 0.396807 0.246043 0.336010 0.345595
chargesum: 0.00000
title: Mulliken charges with hydrogens summed into heavy atoms:
elementType: P O O O O N N N N N C C C C C C C C C
charge: 1.254527 -0.236905 -0.482876 -0.277769 -0.593069 -0.168754 -0.079217 -0.050846 -0.060741 0.073315 0.263658 0.069049 0.174875 -0.037121 0.150718 0.044848 -0.102110 0.174563 -0.116145
polarizability: 2.15366624e+02 6.55885312e+00 1.63330504e+02 2.27205465e+01 -8.45648674e+00 1.18228843e+02
1716.lowfreq: -9.5238 -4.5616 -0.0016 -0.0012 -0.0007 2.1189 18.8629 26.7508 33.9469
frequency: 18.6378 26.6923 33.9265 65.0382 108.9091 141.8480 168.6521 179.3128 188.6539 215.3303 224.9711 250.8340 269.9291 285.6855 298.4198 307.7574 320.4604 338.4595 385.4976 411.9456 441.6094 508.8537 523.0839 530.7733 549.9260 553.4390 569.0760 578.7984 581.9881 643.9367 667.9670 668.8721 700.4337 718.2391 749.2192 790.7006 803.1522 821.0441 848.3832 876.4679 925.7377 931.4109 949.4910 959.4344 986.5743 1002.6968 1026.0944 1043.4118 1056.2705 1070.6170 1114.1615 1147.6104 1176.3336 1213.0656 1223.5246 1230.9657 1242.4737 1294.7201 1296.4864 1313.0745 1316.1376 1324.8770 1338.7214 1363.1620 1367.9412 1376.1420 1383.5154 1410.2043 1431.5068 1442.1760 1455.9457 1475.7250 1545.8736 1578.6000 1633.1054 2992.0498 2993.9164 3003.6784 3027.3855 3091.9359 3094.6826 3125.6480 3167.7855 3227.0226 3538.9131 3590.3145 3693.8415
redmass: 6.8406 5.5168 7.0070 6.2427 6.5093 4.0274 6.0735 7.0914 6.9852 2.7823 3.1440 3.3652 3.2101 3.3704 4.7241 2.3778 6.6800 2.6020 6.0352 4.8393 2.8342 8.9598 1.2262 4.1881 1.0852 3.4228 6.5343 4.9720 4.8364 4.4722 8.3417 8.2628 7.0575 6.6194 6.7199 3.2777 2.8277 2.1378 5.4823 2.3724 1.7395 1.4326 6.0463 2.4644 1.6454 2.5503 4.0791 3.4753 3.0397 5.2301 2.5429 2.5422 2.0003 1.1485 1.7351 1.8019 1.4410 1.9141 4.2133 1.2331 4.1681 1.2482 1.6725 1.7445 1.5660 1.3868 5.4435 1.0837 2.5422 1.0995 1.6479 2.1184 6.6907 1.9267 2.6833 1.0738 1.0651 1.0720 1.0591 1.1049 1.1035 1.1005 1.0922 1.0985 1.0443 1.0661 1.1056
irintensity: 0.4879 0.2740 0.4792 0.7362 4.6640 6.7314 2.6806 0.1313 4.1969 4.4919 18.9141 14.1975 12.3476 0.4296 10.5372 58.4954 41.2158 82.9886 1.6823 6.6783 7.5074 3.6697 268.7084 3.9823 0.2490 1.1707 20.7041 48.7880 8.7707 60.6412 46.2024 143.7319 4.6987 72.6182 28.8884 25.0302 7.8241 6.6495 8.6892 18.8625 53.2284 11.8698 41.8048 12.6151 41.9082 52.0354 24.1482 115.6806 94.9340 101.8125 1.6677 7.1978 13.2104 3.3491 32.1407 13.0181 49.3768 7.4414 59.0855 6.5503 55.2447 2.4217 12.2232 44.4677 8.1352 4.1650 6.7575 10.5625 69.0258 9.1210 7.8591 37.8650 58.1862 36.6300 612.7394 2.1820 29.1265 18.8772 18.4088 4.7946 13.8049 2.1879 14.2483 0.0086 134.0767 67.8485 50.9383
temp: 298.150 k
press: 1.00000 atm
elementType: 15 8 8 8 8 7 7 7 7 7 6 6 6 6 6 6 6 6 6 1 1 1 1 1 1 1 1 1 1 1 1
symmnumber: 1
zpe: 595512.3 jmol-1
zpe.correction: 0.226819 hartree
zpe.thermalcorrener: 0.244433 hartree
zpe.thermalcorrenthalpy: 0.245377 hartree
zpe.thermalcorrgfe: 0.179601 hartree
zpe.sumelectzpe: -1264.605881 hartree
zpe.sumelectthermal: -1264.588267 hartree
zpe.sumelectthermalent: -1264.587323 hartree
zpe.sumelectthermalfe: -1264.653099 hartree
dipole: -2.0265 3.9297 1.0327
dipole: 4.5404
quadrupole: -115.4787 -121.5837 -118.9822
quadrupole: 9.3208 12.4316 -6.9930
quadrupole: 3.2029 -2.9022 -0.3007 9.3208 12.4316 -6.9930
hfenergy: -1264.8327001 hartree
pointgroup: C01 [X(C9H12N5O4P1)]
dipole: 0.6671458 1.1124368 -1.2281859 debye
polarizability: 215.4296878|11.2773635|158.5330825|20.5706908|-16.3692044|122.963201 unknown
InChI: InChI=1S/C9H12N5O4P/c10-8-7-9(12-3-11-8)14(4-13-7)1-6-2-18-19(15,16)5-17-6/h3-4,6,15H,1-2,5,10H2
charge 0 multiplicity 1
31 atoms
P  -4.197342 -0.392287 0.909044
O  -2.555307 -0.670691 -1.325719
O  -2.724455 0.372983 1.480292
O  -5.036111 0.866001 0.04729
O  -5.004595 -1.084438 2.087383
N  0.870587 0.751002 -1.053297
N  2.621854 2.137142 -0.50676
N  1.710545 -1.372262 -0.069332
N  3.914609 -1.085128 0.987993
N  5.057049 0.981751 1.050657
C  -1.382055 -0.203187 -0.538612
C  -0.398571 0.281373 -1.623746
C  -1.816307 0.907937 0.428288
C  -3.5164 -1.419666 -0.534357
C  1.799331 -0.042951 -0.368674
C  1.420794 2.044863 -1.10507
C  2.8701 0.831503 -0.04026
C  3.963304 0.253395 0.672071
C  2.816381 -1.807698 0.609104
H  -0.940468 -1.053855 0.01974
H  -0.855435 1.103212 -2.202422
H  -0.205961 -0.561448 -2.30955
H  -0.960087 1.316755 0.9888
H  -2.33087 1.715508 -0.1291
H  -4.341538 -1.696604 -1.206278
H  -3.066455 -2.321311 -0.073691
H  0.90371 2.867468 -1.595858
H  -5.68386 1.369642 0.60366
H  2.826212 -2.865684 0.887107
H  5.807343 0.516649 1.557828
H  5.111498 1.972828 0.825367
