program: Gaussian 09
title: 000189917
version: EM64L-G09RevD.01
frameworkgroup: C1[X(C11H14FN5O3)]
method: RPBEPBE
basis: SDD
operation: Freq
keyword: #p
keyword: freq=noraman
keyword: PBEPBE/SDD
title: #p freq=noraman PBEPBE/SDD
converged: NO YES NO NO
title: Mulliken charges:
elementType: F O O O N N N N N C C C C C C C C C C C H H H H H H H H H H H H H H
charge: -0.237696 -0.494215 -0.463878 -0.445687 -0.202010 -0.072853 -0.226167 -0.058886 -0.603030 -0.089380 -0.119531 -0.151159 -0.192481 -0.137726 -0.406680 0.258309 -0.189844 -0.114893 0.169420 -0.321589 0.282722 0.290080 0.251902 0.232605 0.220942 0.240366 0.206771 0.412706 0.377013 0.281924 0.357133 0.255107 0.350875 0.339833
chargesum: 0.00000
title: Mulliken charges with hydrogens summed into heavy atoms:
elementType: F O O O N N N N N C C C C C C C C C C C
charge: -0.237696 -0.081509 -0.086864 -0.088554 -0.202010 -0.072853 -0.226167 -0.058886 0.087678 0.193342 0.170549 0.100743 0.040123 0.083216 0.040457 0.258309 0.092080 -0.114893 0.169420 -0.066483
polarizability: 2.24872695e+02 3.00639425e+00 1.65527115e+02 8.99247442e+00 -6.61046989e+00 9.37572468e+01
1716.lowfreq: -5.9016 -0.0007 -0.0006 0.0005 6.1276 10.1651 24.7931 53.3739 54.5033
frequency: 24.5821 53.3484 54.4929 93.8950 101.1059 127.9363 162.8113 176.3918 197.1846 219.5801 243.7245 252.6987 284.2262 290.0680 309.8288 326.1250 347.3249 363.0210 402.5477 483.5258 526.5700 541.8265 543.3605 554.6329 559.2039 574.0727 582.0218 599.3911 637.6919 639.7035 661.8796 666.9205 708.1133 729.6243 779.7173 788.1694 815.0858 836.1820 872.9419 880.5027 882.9784 926.0275 942.0163 951.8410 969.1788 981.4719 1001.1761 1018.2387 1040.0749 1055.8521 1071.7960 1098.2294 1116.9095 1139.4707 1181.4931 1184.5016 1196.1860 1227.3350 1231.5227 1252.4882 1256.7810 1273.5594 1284.1965 1300.5345 1304.2546 1310.8058 1318.4979 1328.9633 1338.1896 1347.6711 1352.9711 1373.8160 1377.2785 1383.5118 1388.8101 1435.7852 1469.1672 1477.4067 1527.9125 1544.6891 1583.9195 1639.3948 2692.5846 2970.0653 2980.2588 2985.4193 2993.2006 3038.0636 3077.0372 3088.0314 3175.2118 3257.2717 3390.4804 3535.3736 3562.8354 3689.1689
redmass: 6.5606 6.8003 5.8111 6.0325 6.8440 4.2650 5.7550 6.9770 6.2999 5.1336 5.1586 4.1528 5.4118 4.4460 5.4520 7.0605 6.3177 7.0993 4.2928 1.0706 8.8179 2.5151 1.8929 2.1442 1.1738 5.2751 1.4280 2.4189 4.2279 4.5100 6.9532 6.5898 4.9244 5.9521 4.8100 4.1903 1.8599 5.4552 6.9076 3.3900 2.4724 1.3744 2.4487 1.3671 1.7972 2.9248 3.3803 4.1621 2.5942 2.9971 3.6414 4.1564 2.8516 3.3409 1.3831 1.4409 1.9700 1.4068 1.9653 1.4859 1.5968 1.4923 1.9974 1.4138 2.3925 1.2812 1.5033 1.8592 1.8922 1.2586 1.3950 1.3352 1.9041 1.5232 7.2300 3.3024 1.0783 3.9067 1.2247 8.1737 1.7594 2.9456 1.0755 1.0826 1.0777 1.0748 1.0842 1.0833 1.0900 1.0992 1.0928 1.0989 1.0635 1.0445 1.0656 1.1056
irintensity: 0.4127 0.7959 0.0446 4.8745 1.5723 12.1569 1.1010 10.5975 2.4628 1.6441 4.1116 20.6554 5.9408 16.3699 4.2874 5.3900 9.1561 8.6473 1.3141 196.6504 11.1918 68.1972 134.1655 38.7971 22.8187 11.5904 204.1507 53.4815 18.4212 24.4357 19.8918 6.7269 2.9086 28.0539 13.8318 16.3845 6.8915 5.0389 0.6745 25.7022 20.9020 45.8002 42.3509 45.5491 41.2277 59.1783 25.8253 22.8339 15.0784 107.6349 11.3336 1.1595 38.0114 10.9570 19.9138 22.1065 36.8174 8.0890 9.2408 24.6093 35.5800 4.2784 100.2008 9.5937 39.9766 28.7885 40.9590 13.2017 7.8757 15.5126 4.3579 65.6653 33.6553 51.0094 29.7508 56.2628 3.6859 23.9214 252.4916 34.0899 24.1339 640.0935 1635.0843 12.5430 10.8563 30.2914 89.2091 2.3771 24.5747 20.7232 8.6282 0.6765 52.9182 147.7974 9.8509 55.2069
temp: 298.150 k
press: 1.00000 atm
elementType: 9 8 8 8 7 7 7 7 7 6 6 6 6 6 6 6 6 6 6 6 1 1 1 1 1 1 1 1 1 1 1 1 1 1
symmnumber: 1
zpe: 685065.1 jmol-1
zpe.correction: 0.260928 hartree
zpe.thermalcorrener: 0.278112 hartree
zpe.thermalcorrenthalpy: 0.279057 hartree
zpe.thermalcorrgfe: 0.215569 hartree
zpe.sumelectzpe: -1025.355426 hartree
zpe.sumelectthermal: -1025.338241 hartree
zpe.sumelectthermalent: -1025.337297 hartree
zpe.sumelectthermalfe: -1025.400784 hartree
dipole: -4.0159 -2.0076 -0.0017
dipole: 4.4897
quadrupole: -117.3577 -123.6148 -116.0915
quadrupole: 6.7666 -3.2253 -2.8301
quadrupole: 1.6636 -4.5934 2.9298 6.7666 -3.2253 -2.8301
hfenergy: -1025.6163532 hartree
pointgroup: C01 [X(C11H14F1N5O3)]
dipole: 1.644267 -0.6085445 0.214911 debye
polarizability: 223.0955257|4.8997774|166.1287918|16.8375794|-3.6702185|94.9327398 unknown
InChI: InChI=1S/C11H14FN5O3/c12-5-4(1-18)8(19)9(20)7(5)17-3-16-6-10(13)14-2-15-11(6)17/h2-5,7-9,18-20H,1,13H2
charge 0 multiplicity 1
34 atoms
F  -1.863041 -1.816967 0.88777
O  -0.94863 2.402488 -0.148624
O  -3.154583 1.872954 -1.421764
O  -4.619022 -2.383513 0.356526
N  0.414444 -0.534191 -0.234379
N  2.23219 -1.907017 0.104254
N  1.564677 1.671243 -0.010235
N  3.959278 1.438354 0.435293
N  5.021895 -0.660304 0.633209
C  -0.947595 -0.088436 -0.596667
C  -3.375669 -0.367054 -0.455437
C  -2.042322 -1.156109 -0.439413
C  -1.498874 1.121431 0.224353
C  -3.005135 1.116547 -0.178634
C  -4.422759 -0.940475 0.528826
C  1.515013 0.302451 -0.031516
C  0.911423 -1.850437 -0.142853
C  2.623349 -0.558515 0.174243
C  3.884511 0.061494 0.41666
C  2.821763 2.156088 0.226926
H  -0.951494 0.229646 -1.661166
H  -3.790146 -0.415048 -1.478652
H  -2.002605 -1.981533 -1.168367
H  -1.381529 0.908214 1.307908
H  -3.624926 1.568569 0.621492
H  -5.403735 -0.485122 0.316467
H  -4.139661 -0.699982 1.573493
H  0.088327 2.343869 -0.104906
H  -2.466494 2.59907 -1.359842
H  0.263609 -2.717024 -0.234487
H  -3.848047 -2.844337 0.775623
H  2.924769 3.244076 0.254164
H  4.986334 -1.677994 0.627631
H  5.89638 -0.167235 0.804102
