program: Gaussian 09
title: 000189910
version: EM64L-G09RevD.01
frameworkgroup: C1[X(C10H19N)]
method: RPBEPBE
basis: SDD
operation: Freq
keyword: #pfreq=noraman
keyword: PBEPBE/SDD
title: #p freq=noraman PBEPBE/SDD
converged: YES YES NO NO
title: Mulliken charges:
elementType: N C C C C C C C C C C H H H H H H H H H H H H H H H H H H H
charge: -0.146804 0.301278 0.132637 -0.753844 -0.710435 -0.697132 -0.664769 -0.685631 -0.725044 0.266751 -0.565676 0.227307 0.210400 0.231672 0.231739 0.226030 0.197821 0.219182 0.204756 0.218559 0.245173 0.218398 0.210242 0.226920 0.216036 0.209797 0.223435 0.219556 0.231559 0.280087
chargesum: 0.00000
title: Mulliken charges with hydrogens summed into heavy atoms:
elementType: N C C C C C C C C C C
charge: -0.146804 0.301278 0.132637 -0.084466 -0.054845 -0.054635 0.009044 -0.032878 -0.050495 0.266751 -0.285589
polarizability: 1.24281600e+02 -6.50207992e+00 1.12136539e+02 -5.58025999e+00 6.42855372e+00 1.04420798e+02
1716.lowfreq: -25.9563 -8.8072 -0.0009 -0.0006 0.0003 18.2849 65.3080 82.9646 127.2056
frequency: 65.1832 82.8988 127.1722 153.4356 160.1319 172.2976 207.4694 215.3772 246.2037 289.6683 290.9770 316.5294 325.4938 346.4558 363.5620 387.1545 401.4204 418.9441 452.3139 490.7042 499.9156 549.6775 581.1376 612.5954 624.8348 633.7337 718.0934 788.5390 887.7351 899.7903 910.1363 922.7906 941.1059 949.3926 1001.6526 1014.8355 1018.8851 1067.5862 1100.2000 1126.8496 1164.4496 1183.1380 1192.7988 1219.9136 1224.4925 1247.2943 1365.2727 1370.1903 1372.8579 1391.1911 1398.8463 1432.1368 1449.8237 1458.3534 1461.1530 1462.0282 1465.9972 1473.9811 1475.2654 1484.9180 1489.6505 1498.1601 1507.0165 1518.4206 2104.9875 2909.4853 2981.0173 2985.6394 2992.9886 2994.0996 3005.7427 3065.0350 3069.9342 3075.8032 3086.3633 3090.0424 3091.4868 3094.4198 3100.1816 3105.7848 3119.6447 3124.3210 3127.3837 3424.9995
redmass: 2.4887 2.9371 2.6121 1.9044 1.2704 1.5102 1.2112 1.0970 1.9787 2.5089 2.4262 1.6772 1.8149 2.2173 1.2251 2.1587 2.4957 2.4532 2.1719 2.8556 2.7932 3.7353 4.9063 3.3610 1.2260 1.2422 3.3245 2.6240 2.1787 1.6952 1.6928 1.6340 1.2369 1.9051 1.4028 1.4445 1.3735 3.3418 1.3566 1.7833 2.7821 2.1616 2.4719 2.6508 3.0333 3.5709 1.1938 1.2021 1.1916 1.1913 1.1948 1.1249 1.0561 1.0581 1.0529 1.0497 1.0533 1.0471 1.0497 1.0565 1.0527 1.0520 1.0498 1.0504 6.0554 1.0565 1.0359 1.0360 1.0383 1.0351 1.0354 1.0782 1.0978 1.0983 1.0987 1.0988 1.1002 1.0992 1.0991 1.1009 1.0961 1.0995 1.0965 1.1565
irintensity: 0.2708 0.0236 0.2307 0.7537 0.1335 0.3476 0.6911 0.7326 1.9868 0.9377 3.9048 0.7041 1.9659 3.4209 0.3492 0.8148 0.5123 3.2400 0.1404 5.6076 0.9354 0.9598 11.3232 0.0775 72.7683 71.9280 2.7846 5.9402 17.9497 0.5721 0.6607 3.1049 0.8766 9.8030 3.3947 2.2427 0.8742 10.0349 4.2475 52.2001 29.4714 2.5466 47.0849 72.9061 10.9816 30.7761 5.4467 16.1292 30.8467 30.6399 18.3847 1.0671 1.9344 0.0583 5.4025 1.0522 7.9069 9.2283 24.6446 1.7912 4.7819 22.1889 19.9081 3.2288 6.3163 69.3857 26.1386 22.1431 42.3684 15.6469 21.2669 32.8434 23.3778 10.3061 55.9772 52.3828 11.0728 42.2310 51.8106 30.8053 28.1122 15.5333 34.1714 60.8967
temp: 298.150 k
press: 1.00000 atm
elementType: 7 6 6 6 6 6 6 6 6 6 6 1 1 1 1 1 1 1 1 1 1 1 1 1 1 1 1 1 1 1
symmnumber: 1
zpe: 695147.5 jmol-1
zpe.correction: 0.264768 hartree
zpe.thermalcorrener: 0.278992 hartree
zpe.thermalcorrenthalpy: 0.279936 hartree
zpe.thermalcorrgfe: 0.226233 hartree
zpe.sumelectzpe: -446.210414 hartree
zpe.sumelectthermal: -446.196190 hartree
zpe.sumelectthermalent: -446.195246 hartree
zpe.sumelectthermalfe: -446.248949 hartree
dipole: -0.4097 -0.0188 -0.0696
dipole: 0.4160
quadrupole: -69.5811 -67.9562 -70.6396
quadrupole: 0.1562 0.2700 0.0287
quadrupole: -0.1888 1.4361 -1.2473 0.1562 0.2700 0.0287
hfenergy: -446.475182 hartree
pointgroup: C01 [X(C10H19N1)]
dipole: 0.1590819 0.0315508 -0.0219704 debye
polarizability: 125.2995927|-7.906327|114.628904|0.12265|1.7273131|100.9104404 unknown
InChI: InChI=1S/C10H19N/c1-8-10(5,6)11(7)9(2,3)4/h1H,2-7H3
charge 0 multiplicity 1
30 atoms
N  0.261862 -0.379021 0.603868
C  1.48401 0.126278 -0.166022
C  -1.082839 -0.555468 -0.088653
C  2.639616 0.366402 0.852704
C  2.022789 -0.961716 -1.142513
C  1.234047 1.46731 -0.920218
C  0.083921 0.313555 1.912992
C  -1.911384 -1.610786 0.716629
C  -1.003932 -1.113702 -1.538456
C  -1.860318 0.726223 -0.1333
C  -2.485466 1.791057 -0.123724
H  2.828971 -0.541013 1.454367
H  3.560105 0.603493 0.290353
H  2.441589 1.212433 1.531688
H  1.43636 -1.053532 -2.067192
H  2.036477 -1.941937 -0.633922
H  3.057342 -0.707749 -1.439436
H  0.883382 2.252211 -0.225693
H  2.174356 1.817616 -1.386169
H  0.478799 1.367287 -1.717542
H  0.905818 0.057097 2.598871
H  -0.847803 -0.02433 2.389574
H  0.020995 1.422886 1.829227
H  -1.334906 -2.551047 0.75749
H  -2.133254 -1.289599 1.746412
H  -2.876176 -1.793779 0.211357
H  -2.034096 -1.291239 -1.892932
H  -0.530016 -0.413404 -2.241987
H  -0.460827 -2.072994 -1.549608
H  -3.026223 2.719369 -0.129864
