program: Gaussian 09
title: 000189906
version: EM64L-G09RevD.01
frameworkgroup: C1[X(C19H23NO6)]
method: RPBEPBE
basis: SDD
operation: Freq
keyword: #p
keyword: freq=noraman
keyword: PBEPBE/SDD
title: #p freq=noraman PBEPBE/SDD
converged: YES YES NO NO
title: Mulliken charges:
elementType: O O O O O O N C C C C C C C C C C C C C C C C C C C H H H H H H H H H H H H H H H H H H H H H H H
charge: -0.298392 -0.449854 -0.226379 -0.263369 -0.378408 -0.337256 -0.366123 0.261897 -0.406382 -0.103425 -0.726618 -0.685074 -0.689310 -0.344904 0.096778 0.038881 0.103605 0.095722 0.252116 -0.101444 0.239115 -0.356690 0.369259 -0.455054 -0.166136 -0.774265 0.210744 0.226365 0.289232 0.231913 0.197885 0.209634 0.231367 0.203823 0.208786 0.226812 0.221881 0.208627 0.207386 0.245689 0.238534 0.350236 0.286361 0.268599 0.266313 0.256140 0.255758 0.242572 0.387052
chargesum: 0.00000
title: Mulliken charges with hydrogens summed into heavy atoms:
elementType: O O O O O O N C C C C C C C C C C C C C C C C C C C
charge: -0.298392 -0.099618 -0.226379 -0.263369 0.008643 -0.337256 -0.076891 0.261897 0.030727 0.128488 -0.087731 -0.045653 -0.051416 0.139319 0.096778 0.038881 0.103605 0.095722 0.252116 -0.101444 0.239115 -0.070329 0.369259 -0.186454 0.100177 -0.019794
polarizability: 3.22743434e+02 -1.82683826e+01 2.81420681e+02 -9.83822183e+00 3.28619082e+00 1.37523271e+02
1716.lowfreq: -6.8498 -3.3765 -0.0006 -0.0005 0.0007 2.1146 11.4665 22.9367 27.1992
frequency: 10.9197 22.6742 27.1377 33.5539 50.8402 74.5451 82.7591 101.8725 110.5619 121.4793 124.8247 163.6170 170.5988 190.7840 204.2472 215.6706 224.5941 226.4049 237.0884 243.7010 254.1230 267.2187 295.4049 308.3381 318.3657 333.4743 335.4168 365.2492 375.3813 382.1711 398.9767 410.6637 429.1732 442.9346 468.0776 478.0418 510.9208 523.7449 544.2909 545.0000 565.0501 581.1182 607.5311 624.4904 659.1382 685.3637 686.7515 712.6181 738.8820 742.1252 759.2824 770.4994 825.8276 840.3289 847.1415 854.7652 868.5190 879.0476 885.9644 902.0219 919.1787 925.3279 939.2357 951.1297 959.5718 977.0771 988.6482 995.1341 1013.5143 1016.1550 1021.8484 1047.8749 1050.2865 1075.6190 1099.1034 1111.1239 1123.6095 1143.5725 1162.8482 1177.5637 1189.9674 1212.2753 1219.5135 1233.4379 1240.1524 1260.9989 1280.2078 1293.5378 1317.0720 1325.4688 1334.6439 1348.2462 1357.7300 1366.0640 1368.9705 1373.4074 1383.6955 1391.3331 1395.8166 1408.2315 1430.4564 1449.4238 1451.1098 1455.5006 1459.4835 1460.6929 1461.1007 1463.5458 1465.9807 1471.5515 1481.0202 1492.5658 1500.2718 1529.9363 1549.2956 1594.1908 1614.9142 1668.9324 2619.9630 2925.8999 2964.6686 2968.7245 2980.5536 2996.0487 3003.7867 3056.4239 3058.4602 3064.0131 3067.8492 3071.1428 3074.8888 3076.7732 3078.5241 3086.1026 3092.4260 3122.8794 3192.0905 3237.8037 3271.5929 3428.1551 3540.2375
redmass: 5.1677 4.6301 3.6184 3.6743 5.6164 3.7152 4.3748 2.6341 3.0328 1.6170 3.8405 1.4039 3.1238 4.9370 4.0087 4.1800 2.9348 2.8251 1.3121 2.0281 1.1739 6.2500 2.9237 4.3932 7.5207 2.3534 5.8715 2.4568 7.9445 5.3549 1.5338 2.0353 4.1603 2.5603 2.5226 5.6953 3.3229 6.7384 6.9084 4.3469 4.2995 4.8728 7.2213 5.8422 5.7295 2.6025 2.4192 3.1994 2.8033 1.9883 6.5929 3.0004 4.2406 6.3131 3.4536 1.5070 4.5290 1.3532 1.9723 1.9625 1.7615 2.2550 1.2136 4.3527 4.7920 1.0642 2.0412 2.2664 2.9569 1.4095 1.6512 2.3946 1.5317 1.9678 2.8425 1.7794 2.3994 4.3863 4.4703 1.2200 1.9429 2.5065 1.5233 1.4439 2.4463 1.9489 2.1675 3.2459 1.3084 4.1679 2.0379 2.0494 1.3938 1.2483 1.2644 1.3259 4.3250 1.2160 2.5686 1.6485 6.4629 1.0608 1.0435 1.2214 2.3071 1.0846 1.1188 1.0799 1.1170 1.0632 1.0645 1.0629 1.1643 5.7656 4.3960 7.7931 6.9578 5.0489 1.0739 1.0699 1.0355 1.0363 1.0357 1.0378 1.0565 1.0853 1.0976 1.0991 1.0987 1.0942 1.0955 1.0973 1.1085 1.1006 1.0997 1.0994 1.0933 1.0919 1.1091 1.0746 1.0655
irintensity: 0.1409 0.6541 0.4253 0.0960 2.6297 1.2253 1.0312 0.0978 1.7113 0.8085 2.7036 0.1435 0.4869 0.4374 4.8211 1.2225 0.2555 2.2533 1.5850 4.9245 1.0347 2.8421 0.3639 4.5926 6.0636 0.8169 14.3077 0.3028 1.5728 3.9935 53.9221 85.1322 35.1391 7.5388 4.0000 2.2371 28.6226 3.4855 36.5143 0.9458 1.3841 0.9574 0.0928 3.2396 0.8048 41.9353 43.4128 23.7555 1.6669 40.5811 1.2258 14.6263 11.4728 9.3928 5.5037 27.2599 15.0661 6.0511 6.2098 2.4973 4.3427 2.4183 0.5398 146.6934 23.2923 136.5594 78.2015 1.6817 108.7197 0.7951 15.6819 25.3390 11.9398 15.9962 10.1128 114.5385 22.4360 35.3028 32.9333 17.9263 97.5181 72.3325 40.1126 13.4015 42.5448 33.2601 13.0950 69.7278 1.2337 55.5024 56.2350 10.2656 17.5624 29.9526 17.8865 53.8562 68.1801 28.2105 228.9841 158.8691 42.7453 1.7553 17.6247 51.8807 339.0907 27.8794 6.7162 6.2215 2.1630 9.3769 10.8300 26.0830 5.1456 51.3701 34.4209 0.6447 178.6039 180.3954 470.7912 48.9440 31.2589 39.3380 17.8448 4.9562 26.3234 14.9426 6.2966 22.4609 31.2833 112.3184 38.9132 6.1802 20.6737 6.5854 75.5497 10.9621 1.1151 4.0977 0.0206 16.8186 9.6994
temp: 298.150 k
press: 1.00000 atm
elementType: 8 8 8 8 8 8 7 6 6 6 6 6 6 6 6 6 6 6 6 6 6 6 6 6 6 6 1 1 1 1 1 1 1 1 1 1 1 1 1 1 1 1 1 1 1 1 1 1 1
symmnumber: 1
zpe: 1020650.8 jmol-1
zpe.correction: 0.388745 hartree
zpe.thermalcorrener: 0.414679 hartree
zpe.thermalcorrenthalpy: 0.415623 hartree
zpe.thermalcorrgfe: 0.331217 hartree
zpe.sumelectzpe: -1241.941234 hartree
zpe.sumelectthermal: -1241.915300 hartree
zpe.sumelectthermalent: -1241.914356 hartree
zpe.sumelectthermalfe: -1241.998762 hartree
dipole: 0.8799 0.7770 0.1027
dipole: 1.1783
quadrupole: -159.3597 -150.5582 -154.2847
quadrupole: -30.8929 1.1812 2.9731
quadrupole: -4.6255 4.1760 0.4495 -30.8929 1.1812 2.9731
hfenergy: -1242.329979 hartree
pointgroup: C01 [X(C19H23N1O6)]
dipole: 0.3568373 -0.2877094 -0.069239 debye
polarizability: 321.6200623|19.6778558|282.0086464|5.3986211|12.1440301|138.0586766 unknown
InChI: InChI=1S/C19H23NO6/c1-10-7-13(22)14-15(23)12-5-6-24-16(12)18(17(14)26-10)25-9-11(21)8-20-19(2,3)4/h5-7,11,20-21,23H,8-9H2,1-4H3
charge 0 multiplicity 1
49 atoms
O  0.472283 -1.216073 -0.078496
O  2.132006 -3.520781 0.008549
O  -2.203924 -1.986932 -0.130451
O  0.971094 1.713107 0.324678
O  -3.665734 2.677932 0.320888
O  -5.330859 0.775532 0.064992
N  3.801378 -0.121972 0.078037
C  5.101771 0.474515 -0.363532
C  3.387711 -1.429684 -0.470856
C  2.565771 -2.230688 0.571482
C  5.165167 1.886499 0.269858
C  6.274394 -0.379269 0.18113
C  5.208329 0.59652 -1.914196
C  1.362913 -1.452843 1.108922
C  -0.538834 -0.266772 0.088724
C  -1.90638 -0.615955 0.019154
C  -0.30083 1.118662 0.241825
C  -2.963097 0.349329 0.089544
C  -1.304632 2.123266 0.329071
C  -2.665844 1.743705 0.250662
C  -4.357943 -0.087482 0.002116
C  -0.613918 3.392362 0.474374
C  -3.535572 -2.404595 -0.21458
C  -4.58438 -1.514464 -0.154559
C  0.733112 3.116572 0.46967
C  -3.627113 -3.892705 -0.371476
H  2.786493 -1.348772 -1.404431
H  4.277974 -2.035055 -0.711013
H  3.041583 0.569552 0.002863
H  3.216757 -2.489047 1.424611
H  4.33036 2.517921 -0.094717
H  6.110978 2.392744 0.006984
H  5.09333 1.815345 1.369688
H  7.242943 0.094646 -0.062784
H  6.282406 -1.394328 -0.256731
H  6.190729 -0.477833 1.277657
H  5.134211 -0.395652 -2.396635
H  6.174236 1.04559 -2.213425
H  4.394565 1.232341 -2.312095
H  1.678619 -0.49113 1.550419
H  0.796596 -2.053344 1.844437
H  1.399478 -3.326424 -0.632672
H  -1.078232 4.370861 0.568068
H  -5.612079 -1.875782 -0.223525
H  1.630829 3.722487 0.553481
H  -3.134217 -4.403133 0.475475
H  -3.111672 -4.2184 -1.293043
H  -4.678942 -4.213302 -0.418752
H  -4.567012 2.151527 0.236311
