program: Gaussian 09
title: 000189901
version: EM64L-G09RevD.01
frameworkgroup: C1[X(C19H16ClN5)]
method: RPBEPBE
basis: SDD
operation: Freq
keyword: #p
keyword: freq=noraman
keyword: PBEPBE/SDD
title: #p freq=noraman PBEPBE/SDD
converged: YES YES NO NO
title: Mulliken charges:
elementType: Cl N N N N N C C C C C C C C C C C C C C C C C C C H H H H H H H H H H H H H H H H
charge: -0.015304 -0.144007 -0.088774 0.048013 -0.437588 -0.004968 -0.587860 0.182722 0.507243 -0.143721 -0.222165 0.202930 -0.413998 -0.360128 0.442663 -0.416278 -0.358018 0.464351 -0.367953 -0.803161 -0.455568 -0.337606 -0.197505 -0.220429 -0.254536 0.229620 0.262210 0.268610 0.225506 0.266657 0.231945 0.234048 0.341578 0.232901 0.224102 0.234677 0.225263 0.320158 0.227018 0.227919 0.229429
chargesum: 0.00000
title: Mulliken charges with hydrogens summed into heavy atoms:
elementType: Cl N N N N N C C C C C C C C C C C C C C C C C C C
charge: -0.015304 -0.144007 -0.088774 0.048013 -0.096009 -0.004968 -0.096030 0.182722 0.507243 -0.143721 0.046446 0.202930 -0.188491 -0.093471 0.442663 -0.184333 -0.123970 0.464351 -0.367953 -0.111480 -0.230304 -0.017448 0.029513 0.007490 -0.025107
polarizability: 3.95405306e+02 -9.58960111e+00 2.50993170e+02 -2.97965554e+01 1.75579627e+01 1.63186711e+02
1716.lowfreq: -41.4476 -2.7123 -1.2912 -0.0008 0.0010 0.0012 2.8271 10.3551 17.6449
frequency: -41.3290 9.7929 17.6082 32.2092 39.5009 51.4985 71.9954 95.9729 117.3527 135.6666 150.2668 197.3895 211.3692 231.0679 251.4901 279.3477 295.6891 319.3643 339.9342 361.6305 366.2782 376.0312 406.1396 408.5571 471.4398 500.3445 509.6174 533.9667 551.2215 590.3726 616.1804 621.7367 638.1124 647.4928 661.9769 691.8818 696.4096 718.2602 720.9667 747.6857 757.4841 770.6273 777.9838 788.0581 814.6536 817.6837 820.3219 845.3013 845.5882 859.1371 890.7149 921.3039 939.9024 960.2486 974.6155 984.7791 986.1899 991.4351 1005.2410 1006.0419 1015.8257 1029.1836 1048.2752 1087.4487 1102.1573 1118.6326 1138.3187 1172.4745 1184.8247 1191.0501 1196.0723 1216.6127 1222.8196 1227.8554 1253.7526 1300.6370 1308.6974 1321.4528 1327.0021 1345.9852 1359.6418 1369.3564 1380.7997 1388.4622 1399.7545 1410.8139 1421.7142 1445.3275 1450.9388 1469.5784 1470.8718 1476.3323 1488.2000 1510.4317 1514.0824 1547.1402 1586.3146 1588.5850 1613.9442 1621.1228 1626.6062 2980.8299 3020.0104 3059.4630 3079.5436 3089.3275 3112.2161 3112.9429 3120.1075 3133.6339 3137.9480 3144.0596 3146.0667 3166.4838 3190.8948 3236.4580 3487.9162
redmass: 1.0274 5.3961 5.8137 3.9805 4.2776 5.4562 6.7012 6.0786 7.0966 6.4577 5.3268 6.7627 6.5553 5.9573 5.1184 4.9384 2.8193 4.9089 5.1933 11.6824 11.4143 2.2853 2.8438 2.9362 3.3613 4.7256 2.9141 6.8851 6.1529 5.1932 6.5254 4.6988 6.7852 4.2585 10.8663 4.2357 1.8467 1.5327 5.0052 5.9013 2.9147 1.6945 7.5142 4.2456 4.2098 1.8003 3.8449 1.7105 1.3971 1.3114 7.8220 1.4253 1.7577 1.4666 1.3476 6.0809 1.3661 1.4641 1.3097 5.8193 2.9524 2.1404 1.5663 1.7497 3.0519 2.0361 1.6428 1.0561 1.8720 1.1971 1.1169 4.0718 2.3316 2.6575 2.6772 6.7244 1.6314 1.5543 1.5896 6.3341 1.7756 3.1057 4.5065 6.6637 1.2817 2.6570 3.0510 2.5845 2.7750 1.0490 1.3318 1.1060 2.1620 2.7447 3.7020 6.9753 6.8799 6.0364 4.4981 3.9640 6.2989 1.0374 1.0594 1.0975 1.1050 1.0988 1.0877 1.0886 1.0880 1.0868 1.0960 1.0976 1.0934 1.0997 1.0957 1.0985 1.0758
irintensity: 0.4369 0.4916 0.3665 0.1857 0.2506 0.2646 0.5614 0.3878 1.2108 1.4761 1.2350 1.1589 2.5795 1.2256 1.3456 1.4479 2.4303 1.3882 0.3135 3.4953 1.4070 0.5221 0.1654 0.0007 12.2968 7.9304 21.1481 8.2728 23.5236 2.9806 4.0190 1.3774 0.1695 24.7996 1.2812 42.1374 29.2039 36.9537 18.4973 18.9561 46.8638 94.9566 7.8395 40.6025 14.7984 4.4028 7.0283 6.5682 3.4413 5.3026 48.5945 13.0168 2.9886 4.4414 0.0116 0.4129 1.7503 4.4420 2.8518 20.7180 6.8069 22.8196 12.4386 32.8591 3.7240 53.8449 12.7180 0.8007 36.0892 6.2617 6.6563 15.1191 9.5921 115.7874 62.7368 127.0218 42.0146 14.0565 17.0383 186.2933 14.7059 49.3046 6.9454 2.7731 9.9912 6.0399 75.7784 51.1724 13.1796 8.7345 52.8525 16.2117 208.7731 29.3763 20.4997 260.1023 470.4742 5.9532 354.0770 281.5880 7.6130 33.6525 28.2709 19.4432 4.0108 19.7460 13.7224 12.2632 9.4503 0.1579 30.0479 4.0829 28.3072 30.1505 15.3648 0.1696 40.3579
temp: 298.150 k
press: 1.00000 atm
elementType: 17 7 7 7 7 7 6 6 6 6 6 6 6 6 6 6 6 6 6 6 6 6 6 6 6 1 1 1 1 1 1 1 1 1 1 1 1 1 1 1 1
symmnumber: 1
zpe: 823079.4 jmol-1
zpe.correction: 0.313494 hartree
zpe.thermalcorrener: 0.333797 hartree
zpe.thermalcorrenthalpy: 0.334741 hartree
zpe.thermalcorrgfe: 0.260524 hartree
zpe.sumelectzpe: -1465.729138 hartree
zpe.sumelectthermal: -1465.708835 hartree
zpe.sumelectthermalent: -1465.707891 hartree
zpe.sumelectthermalfe: -1465.782108 hartree
dipole: 3.2497 -3.7451 -0.0256
dipole: 4.9586
quadrupole: -124.3416 -153.4005 -147.5207
quadrupole: -0.7947 -2.3176 5.8401
quadrupole: 17.4126 -11.6462 -5.7665 -0.7947 -2.3176 5.8401
hfenergy: -1466.0426321 hartree
pointgroup: C01 [X(C19H16Cl1N5)]
dipole: -1.2411499 1.4960778 0.1646388 debye
polarizability: 395.4942932|-16.1722242|254.3961017|25.0201277|-8.31715|159.6947923 unknown
InChI: InChI=1S/C19H16ClN5/c1-13-7-9-14(10-8-13)11-25-12-21-16-17(23-19(20)24-18(16)25)22-15-5-3-2-4-6-15/h2-10,12,22H,11H2,1H3
charge 0 multiplicity 1
41 atoms
Cl 0.921224 -3.776403 -0.809115
N  -1.552022 0.727876 -1.401376
N  0.216249 2.069139 -0.800536
N  -0.465555 -1.49577 -1.14163
N  2.892874 0.858906 -0.030515
N  1.871658 -1.293152 -0.427033
C  -2.916906 0.301973 -1.800569
C  -0.491795 -0.128364 -1.100526
C  -3.885358 0.203421 -0.627938
C  0.588402 0.716835 -0.738742
C  -1.072407 2.030367 -1.197603
C  1.819283 0.079441 -0.388693
C  -4.91118 1.160247 -0.450919
C  -3.774434 -0.86014 0.304705
C  -5.697889 0.00883 1.579689
C  -5.806015 1.063099 0.639586
C  -4.666749 -0.950986 1.391076
C  4.216314 0.512768 0.356165
C  0.7527 -1.961774 -0.792726
C  -6.652833 -0.099925 2.755881
C  5.090682 1.588895 0.6736
C  4.687954 -0.825283 0.435145
C  6.419155 1.333087 1.064832
C  6.022156 -1.062365 0.828774
C  6.895262 0.003374 1.145217
H  -3.284758 1.020452 -2.554063
H  -2.794658 -0.680299 -2.290693
H  -1.699879 2.905455 -1.350935
H  -5.019843 1.983946 -1.16815
H  -2.989205 -1.614295 0.171223
H  -6.597493 1.812283 0.75963
H  -4.568132 -1.780469 2.101962
H  2.680927 1.862878 -0.053252
H  -7.175716 -1.074296 2.759529
H  -7.418076 0.694341 2.73157
H  -6.112908 -0.018679 3.717875
H  4.728023 2.623358 0.613598
H  4.012285 -1.646448 0.191155
H  7.081318 2.171577 1.306472
H  6.379772 -2.096404 0.887327
H  7.928071 -0.196501 1.449005
