program: Gaussian 09
title: 000189900
version: EM64L-G09RevD.01
frameworkgroup: C1[X(C15H12N2O2)]
method: RPBEPBE
basis: SDD
operation: Freq
keyword: #p
keyword: freq=noraman
keyword: PBEPBE/SDD
title: #p freq=noraman PBEPBE/SDD
converged: YES YES NO NO
title: Mulliken charges:
elementType: O O N N C C C C C C C C C C C C C C C H H H H H H H H H H H H
charge: -0.181862 -0.152601 -0.360224 0.054091 0.492796 0.227600 0.068593 -0.188545 0.141975 0.504823 -0.348945 -0.349796 -0.535029 -0.407223 -0.408396 -0.270745 -0.670014 -0.142098 -0.340679 0.266786 0.264729 0.210889 0.211093 0.235838 0.235280 0.278113 0.222642 0.217949 0.224861 0.241155 0.256942
chargesum: 0.00000
title: Mulliken charges with hydrogens summed into heavy atoms:
elementType: O O N N C C C C C C C C C C C C C C C
charge: -0.181862 -0.152601 -0.360224 0.054091 0.492796 0.227600 0.068593 -0.188545 0.141975 0.504823 -0.082159 -0.085067 -0.113046 -0.171386 -0.173116 0.007368 -0.004561 0.099057 -0.083737
polarizability: 3.07859620e+02 -8.84740879e-01 1.73716954e+02 -4.25496383e+00 6.61746713e+00 9.13392113e+01
1716.lowfreq: -3.7400 0.0002 0.0007 0.0008 1.8423 3.0654 24.1511 36.8392 48.4727
frequency: 24.0371 36.8325 48.4724 64.9403 117.6283 125.4046 156.0552 184.5820 208.6805 230.4979 259.1143 276.9705 318.9047 345.9076 385.5799 403.8179 405.0198 430.2337 443.7507 520.8652 523.8179 551.6663 575.9827 634.0615 663.0026 671.2181 710.6015 716.3259 738.0977 758.9173 786.4350 805.6673 828.2166 830.3849 835.0945 837.2058 875.9341 953.0004 954.3384 968.4729 969.2441 997.9316 1011.2810 1021.6471 1034.1770 1052.0868 1061.2705 1067.7874 1112.8237 1137.0467 1162.1951 1198.2902 1221.2053 1229.7056 1241.4773 1275.5152 1312.0625 1320.6597 1326.5910 1352.3604 1381.2404 1388.6558 1404.7346 1417.1019 1442.2659 1471.3504 1474.2203 1489.1947 1508.0935 1570.3429 1583.2184 1595.4051 1621.8589 1633.6721 1685.4317 2980.7956 2988.0619 3039.2547 3079.9274 3085.3697 3128.0096 3131.0393 3145.8728 3160.5971 3178.9555 3182.9390 3186.0893
redmass: 2.6715 5.1475 4.1067 4.8695 4.3855 6.2401 6.3162 4.1902 1.4213 4.1794 5.5886 5.6834 2.9520 11.0663 3.3200 3.2176 3.7358 4.5940 5.0286 4.3189 8.4490 4.1738 5.0917 6.7144 7.5221 5.1243 5.3033 5.7792 4.1980 4.0297 1.1631 3.2270 1.9246 2.9353 1.4310 2.0361 6.7898 1.3627 1.4035 1.7656 1.7351 1.4025 3.3009 2.8340 3.1106 1.8763 2.0569 3.0685 3.6852 1.3004 1.5724 1.1291 2.1936 3.6980 1.2560 2.0138 1.5176 1.2851 6.8172 7.0172 6.0582 1.1971 2.5742 2.9901 2.1324 1.0433 1.0666 1.0937 2.5524 7.8826 6.9817 7.5118 6.3537 12.5194 12.8317 1.0349 1.0599 1.1018 1.1002 1.1012 1.0903 1.0905 1.0889 1.0924 1.1000 1.0941 1.0951
irintensity: 0.4083 2.1541 0.3687 1.9925 0.5037 1.9456 3.9104 0.0525 0.4731 1.7387 0.3222 3.0823 0.6450 8.4505 0.1852 0.2828 0.7966 0.3127 0.3165 11.6430 6.0827 18.0501 11.7634 0.9710 5.6585 5.1627 9.7474 25.6215 4.5963 2.7140 2.9363 17.8233 42.8046 10.0010 13.5128 19.3725 12.9336 5.3398 0.0865 4.1604 4.3160 0.5021 3.9397 5.1919 60.0927 49.9856 31.0589 3.0379 40.2611 18.9733 9.1462 2.8549 0.3761 21.0904 0.1077 0.5835 0.7073 2.1410 274.8939 47.8639 0.5103 9.2866 19.2270 9.4304 6.6376 14.8454 1.5313 7.1339 107.4695 37.4008 6.9196 8.3944 2.1950 383.0225 13.7858 42.7323 39.6840 7.9092 63.5224 38.5177 17.3898 21.2477 5.5687 7.0029 17.9429 2.4476 0.2299
temp: 298.150 k
press: 1.00000 atm
elementType: 8 8 7 7 6 6 6 6 6 6 6 6 6 6 6 6 6 6 6 1 1 1 1 1 1 1 1 1 1 1 1
symmnumber: 1
zpe: 617660.6 jmol-1
zpe.correction: 0.235255 hartree
zpe.thermalcorrener: 0.251047 hartree
zpe.thermalcorrenthalpy: 0.251991 hartree
zpe.thermalcorrgfe: 0.190470 hartree
zpe.sumelectzpe: -837.447804 hartree
zpe.sumelectthermal: -837.432012 hartree
zpe.sumelectthermalent: -837.431068 hartree
zpe.sumelectthermalfe: -837.492589 hartree
dipole: -1.3522 2.2200 -0.1106
dipole: 2.6017
quadrupole: -71.7493 -121.9608 -110.4003
quadrupole: -8.5103 -0.2510 6.4696
quadrupole: 29.6208 -20.5907 -9.0302 -8.5103 -0.2510 6.4696
hfenergy: -837.6830587 hartree
pointgroup: C01 [X(C15H12N2O2)]
dipole: 0.5262703 0.8745727 0.0769856 debye
polarizability: 307.873595|1.877609|174.1026237|-3.2728565|-3.6729421|90.9395665 unknown
InChI: InChI=1S/C15H12N2O2/c1-2-10-5-7-11(8-6-10)17-14(18)12-4-3-9-16-13(12)15(17)19/h3-9H,2H2,1H3
charge 0 multiplicity 1
31 atoms
O  0.819689 2.37996 0.377186
O  0.667631 -2.305467 -0.319396
N  0.348487 0.045903 0.049651
N  3.653801 -1.493346 -0.30223
C  -1.090972 0.078328 0.113171
C  2.595359 0.695402 0.055603
C  1.19589 1.199158 0.184269
C  2.566258 -0.70239 -0.146921
C  1.127746 -1.156957 -0.15957
C  -3.937565 0.141251 0.242043
C  -1.796558 -0.979998 0.736903
C  -1.802571 1.169232 -0.443904
C  -5.458612 0.150541 0.267782
C  -3.20418 -0.941848 0.790234
C  -3.209662 1.193789 -0.369229
C  3.825837 1.368805 0.109054
C  -6.071171 -0.538629 -0.982169
C  4.985229 0.568209 -0.050202
C  4.855273 -0.830774 -0.250386
H  -1.253635 -1.825258 1.165827
H  -1.262838 1.995009 -0.91293
H  -5.822283 -0.365529 1.176838
H  -5.827663 1.192489 0.321547
H  -3.741593 -1.766161 1.274224
H  -3.750972 2.04737 -0.794647
H  3.877331 2.450521 0.265022
H  -5.75538 -0.026689 -1.909073
H  -7.175568 -0.523352 -0.938032
H  -5.742793 -1.591318 -1.052407
H  5.983548 1.014805 -0.02123
H  5.744641 -1.457654 -0.375025
