program: Gaussian 09
title: 000189898
version: EM64L-G09RevD.01
frameworkgroup: C1[X(C12H15N5O4)]
method: RPBEPBE
basis: SDD
operation: Freq
keyword: #p
keyword: freq=noraman
keyword: PBEPBE/SDD
title: #p freq=noraman PBEPBE/SDD
converged: YES YES NO NO
title: Mulliken charges:
elementType: O O O O N N N N N C C C C C C C C C C C C H H H H H H H H H H H H H H H
charge: -0.286084 -0.453306 -0.468055 -0.437458 -0.213193 -0.088500 -0.081070 -0.053782 -0.607354 -0.073991 -0.150097 -0.251447 -0.038071 -0.335462 0.122044 0.250092 -0.084813 -0.153778 0.135432 -0.383923 -0.551043 0.249696 0.259485 0.300146 0.258019 0.203086 0.220670 0.368816 0.366641 0.354508 0.233536 0.242913 0.220806 0.244056 0.346132 0.335349
chargesum: 0.00000
title: Mulliken charges with hydrogens summed into heavy atoms:
elementType: O O O O N N N N N C C C C C C C C C C C C
charge: -0.286084 -0.084490 -0.101415 -0.082950 -0.213193 -0.088500 -0.081070 -0.053782 0.074127 0.175705 0.109387 0.048699 0.219948 0.088294 0.122044 0.250092 -0.084813 0.079757 0.135432 -0.141009 -0.086181
polarizability: 2.17482545e+02 3.67188902e+00 2.35417658e+02 1.21966842e+01 9.07138830e+00 1.10616768e+02
1716.lowfreq: -10.2193 0.0005 0.0006 0.0007 4.0850 4.6828 12.6486 18.4057 56.1286
frequency: 10.7031 17.9302 56.1213 70.8654 77.5619 94.4563 111.3410 132.6303 155.6895 163.7554 179.3690 211.8773 236.5972 259.2273 286.4236 301.0958 310.5917 315.0103 324.5748 369.8848 399.7280 422.5849 456.0652 500.3802 511.0666 525.4348 549.9829 550.5334 562.0082 575.6200 579.6742 595.7381 609.7265 651.9707 666.4001 692.6473 716.7370 757.1869 767.3174 794.0259 804.5860 847.4998 874.6214 901.9358 924.3454 926.0888 963.1841 966.0950 975.1035 983.0523 989.3417 1014.9575 1017.1841 1035.0223 1050.5324 1057.2528 1072.1019 1110.3574 1162.2873 1184.0463 1197.7099 1211.9692 1215.1668 1250.2478 1264.0605 1269.5774 1283.8767 1293.8257 1302.9834 1305.3396 1316.2232 1325.0885 1338.8854 1349.3415 1367.5254 1381.7109 1384.6937 1398.6880 1403.0575 1418.4686 1449.8016 1460.4276 1476.7517 1537.4144 1581.8021 1629.3100 1642.5416 2961.6697 3023.5465 3028.3812 3057.3644 3076.5944 3079.5962 3110.2673 3144.9320 3162.1431 3226.0380 3410.2853 3538.9668 3547.3548 3595.2735 3693.6438
redmass: 6.1944 6.1447 5.7164 3.5963 4.1803 4.6264 5.6408 3.1302 3.6966 5.3890 3.6767 5.3325 6.8150 2.4038 4.0141 3.3430 4.6259 1.9280 3.8960 3.1504 4.3066 4.8121 1.2740 5.5987 2.9979 1.2459 1.0687 3.6803 3.4108 1.7349 4.5392 2.2279 3.4917 4.7048 9.6822 4.2687 6.0027 4.2371 5.5000 10.1304 3.3946 7.5306 3.9784 4.3340 1.5268 4.2668 1.3943 2.7487 3.2186 1.1656 2.9589 3.2322 3.0324 3.1643 3.2553 1.7643 3.6498 2.1432 1.2824 1.2596 3.6332 3.2436 1.3300 2.5336 1.2798 1.6594 1.4174 1.3726 1.4066 3.3095 1.3222 5.6403 1.2753 1.5387 1.5395 1.5942 1.2602 1.5553 1.9211 2.0765 2.9724 1.0853 4.4874 7.1126 1.9228 2.8055 4.5379 1.0675 1.0846 1.0872 1.0880 1.0964 1.0857 1.0589 1.0928 1.0918 1.1162 1.0644 1.0443 1.0656 1.0669 1.1056
irintensity: 0.3787 0.8732 1.0152 2.3273 6.1691 9.6235 0.7630 1.7097 4.0203 1.9242 0.8822 1.7151 4.9278 34.8678 0.4397 6.7823 5.1811 32.9365 0.8745 14.4619 4.3095 4.0630 129.1813 2.0390 1.9463 277.1583 0.1710 28.6381 16.7172 59.4887 4.6445 69.8097 19.7186 20.5308 15.0966 9.3602 60.0356 6.2581 21.3899 3.1162 16.3234 25.4062 44.2204 108.8434 7.9469 68.8068 61.1603 17.4304 87.7155 53.0445 127.9396 58.4734 21.8527 9.7786 43.2682 16.5135 17.6954 6.2308 37.9771 32.9785 10.7630 8.1322 10.9626 113.9175 29.3586 11.2293 6.0847 36.4307 62.0837 33.7715 15.1266 26.6970 46.4172 22.2499 98.9044 6.2299 23.0744 9.8736 12.8026 101.2715 0.0373 4.5172 12.8271 53.3812 28.6421 433.0824 159.9798 39.9792 37.6674 24.8381 4.8319 33.9542 10.0754 2.3547 10.1600 14.3304 9.1712 65.2765 134.3783 8.0548 23.0790 47.6635
temp: 298.150 k
press: 1.00000 atm
elementType: 8 8 8 8 7 7 7 7 7 6 6 6 6 6 6 6 6 6 6 6 6 1 1 1 1 1 1 1 1 1 1 1 1 1 1 1
symmnumber: 1
zpe: 724594.1 jmol-1
zpe.correction: 0.275983 hartree
zpe.thermalcorrener: 0.295453 hartree
zpe.thermalcorrenthalpy: 0.296397 hartree
zpe.thermalcorrgfe: 0.226169 hartree
zpe.sumelectzpe: -1039.339651 hartree
zpe.sumelectthermal: -1039.320182 hartree
zpe.sumelectthermalent: -1039.319237 hartree
zpe.sumelectthermalfe: -1039.389466 hartree
dipole: 2.2505 -0.8371 -2.2224
dipole: 3.2718
quadrupole: -111.0307 -114.8416 -134.0643
quadrupole: 8.6567 13.7725 7.6819
quadrupole: 8.9482 5.1373 -14.0855 8.6567 13.7725 7.6819
hfenergy: -1039.6156345 hartree
pointgroup: C01 [X(C12H15N5O4)]
dipole: -0.9090924 -0.0078554 0.9112862 debye
polarizability: 216.713985|2.2135955|213.5067088|15.5309625|-48.1408314|133.2962773 unknown
InChI: InChI=1S/C12H15N5O4/c1-2-6-16-7-10(13)14-4-15-11(7)17(6)12-9(20)8(19)5(3-18)21-12/h2,4-5,8-9,12,18-20H,1,3,13H2
charge 0 multiplicity 1
36 atoms
O  1.793613 0.618325 -0.972644
O  2.657628 1.990425 1.785893
O  3.934789 -0.332095 1.783335
O  3.101773 -1.273899 -2.663067
N  -0.364444 0.872709 0.06936
N  -2.597316 0.963438 -0.491713
N  -0.34156 -1.386004 1.137337
N  -2.570293 -2.428315 1.143186
N  -4.475388 -1.374992 0.22177
C  1.051103 1.253517 0.134608
C  1.782669 0.872975 1.444622
C  2.64464 -0.37399 1.070554
C  2.914886 -0.212689 -0.438095
C  2.915199 -1.520823 -1.232976
C  -0.936424 -0.329679 0.507099
C  -1.412457 1.619032 -0.550137
C  -2.311774 -0.238792 0.159446
C  -1.202975 2.921883 -1.175783
C  -3.138127 -1.349461 0.505564
C  -1.232839 -2.387069 1.416785
C  -2.21931 3.67157 -1.685555
H  1.115007 2.346755 0.019173
H  1.080832 0.664858 2.272109
H  2.07095 -1.290767 1.289067
H  3.860528 0.339812 -0.596136
H  1.967424 -2.067163 -1.038084
H  3.770005 -2.147445 -0.925734
H  3.534866 1.584663 2.04377
H  3.899853 -0.918836 2.578542
H  2.405468 -0.624713 -2.942804
H  -0.173692 3.289947 -1.247005
H  -0.825695 -3.268461 1.9214
H  -2.024624 4.637829 -2.161386
H  -3.254894 3.319831 -1.634383
H  -4.90712 -0.58645 -0.255734
H  -5.021701 -2.192824 0.484418
