program: Gaussian 09
title: 000189886
version: EM64L-G09RevD.01
frameworkgroup: C1[X(C18H23N3O3)]
method: RPBEPBE
basis: SDD
operation: Freq
keyword: #p
keyword: freq=noraman
keyword: PBEPBE/SDD
title: #p freq=noraman PBEPBE/SDD
converged: YES YES NO NO
title: Mulliken charges:
elementType: O O O N N N C C C C C C C C C C C C C C C C C C H H H H H H H H H H H H H H H H H H H H H H H
charge: -0.268798 -0.283602 -0.267056 -0.282943 -0.440446 -0.057517 -0.395811 -0.581358 0.375611 0.459517 0.211476 0.317155 -0.514766 0.203966 -0.603299 -0.521990 -0.011298 -0.698756 -0.759990 -0.699025 0.214821 0.190941 -0.493069 -0.536066 0.278279 0.236536 0.236879 0.236747 0.215241 0.299528 0.265545 0.245649 0.197964 0.201643 0.288770 0.215383 0.231422 0.214447 0.288435 0.198860 0.201623 0.233667 0.233095 0.227455 0.227075 0.222223 0.245837
chargesum: 0.00000
title: Mulliken charges with hydrogens summed into heavy atoms:
elementType: O O O N N N C C C C C C C C C C C C C C C C C C
charge: -0.268798 -0.283602 -0.267056 -0.282943 -0.140918 -0.057517 0.119003 -0.107732 0.375611 0.459517 0.211476 0.317155 -0.299526 0.203966 -0.337754 -0.276341 -0.011298 -0.010379 -0.098738 -0.010107 0.214821 0.190941 0.201148 0.159069
polarizability: 3.76665420e+02 2.15698862e+00 2.58523757e+02 4.13528255e+00 9.28288796e-01 1.35203639e+02
1716.lowfreq: -40.5007 -8.7697 -2.1209 -0.0003 0.0005 0.0007 5.4045 31.0953 33.1333
frequency: -40.4996 30.9691 32.7651 58.1907 67.2885 73.5475 95.9256 127.1538 130.2928 149.7453 190.0924 195.4126 197.4675 205.7250 211.0880 214.0147 243.5490 254.1976 258.1572 265.2206 279.9767 287.2590 301.5231 316.9434 336.4387 352.1059 381.8093 388.4029 396.3349 439.1290 441.4054 454.1687 459.0478 466.3662 497.0489 540.4467 546.5877 580.2391 600.6189 638.1232 672.2170 677.9147 691.3443 702.5577 715.2140 731.6652 738.7042 764.2335 766.4618 795.3440 820.3698 852.7606 890.5590 911.4287 913.6703 918.9640 925.4325 948.9606 952.1551 979.2875 994.1851 1007.2151 1031.1928 1033.6209 1042.3699 1068.6471 1108.4047 1113.6541 1129.9493 1151.2975 1162.1417 1164.0323 1173.6888 1190.2796 1209.3795 1219.0059 1229.8494 1233.4884 1237.1693 1254.1863 1270.9795 1282.1317 1307.8283 1331.2972 1354.5246 1368.1500 1372.3870 1375.2920 1396.5312 1403.4036 1434.2205 1440.6260 1447.6121 1452.0411 1454.6673 1458.8958 1463.0527 1465.4516 1466.6675 1467.6784 1474.3175 1475.2246 1485.8307 1486.8089 1494.7375 1504.8148 1512.7970 1524.9000 1568.6923 1593.7070 1620.2174 1629.7015 2958.5545 2969.4736 2978.0323 2979.7666 2984.4558 2989.6165 3002.2377 3046.6290 3057.5788 3059.4156 3073.6312 3078.4793 3091.9644 3093.5119 3106.7731 3110.3436 3111.4907 3123.2450 3126.5160 3154.1092 3163.1345 3168.9347 3549.6582
redmass: 2.9017 4.2826 3.4944 4.9116 3.4487 4.5582 4.0554 4.0649 4.1447 3.7422 2.7487 1.3407 2.0616 1.4206 2.9089 3.3707 2.0432 1.2395 1.1080 3.3206 1.9659 2.2059 3.0459 3.4934 2.2956 4.5200 3.4724 3.1236 3.9032 3.5022 1.2116 2.7977 3.1377 3.7184 4.9466 4.1355 6.8568 6.6241 6.4857 5.0393 4.2033 2.3958 5.3434 6.6639 5.8594 2.8375 6.0115 4.0452 3.4125 2.3690 4.2306 1.7472 1.4711 3.0665 1.7019 2.9167 1.6765 4.0240 1.2147 3.9486 3.4036 2.7986 1.4935 1.4788 2.8817 2.2311 1.2426 1.2576 2.3958 1.6510 1.6589 1.9020 3.7967 1.9621 1.6308 2.0113 2.6672 3.0163 2.4525 1.6514 1.2994 3.5013 2.1200 1.6709 2.2319 1.2079 1.2462 4.1009 1.2262 2.8015 1.6778 1.3789 1.0462 1.1334 1.6001 1.0555 1.0876 1.0803 1.2717 1.0622 1.0488 1.1064 1.0846 1.5345 1.5165 1.0982 3.7011 2.2033 8.2572 7.4700 7.9690 8.7630 1.0329 1.0368 1.0675 1.0355 1.0364 1.0654 1.0284 1.1040 1.0964 1.1002 1.1001 1.0992 1.0952 1.0973 1.1001 1.0997 1.1051 1.0994 1.1053 1.0915 1.0917 1.0897 1.0769
irintensity: 7.1403 0.2019 0.5031 10.7990 1.3860 1.0145 2.7062 1.8600 1.7820 0.4378 2.3782 1.0745 2.8051 0.4384 1.2590 3.1058 1.7850 0.2264 0.5874 1.5174 0.9036 0.1354 0.9756 5.2564 0.6538 9.5647 3.0421 0.7588 4.7717 1.4857 35.3083 5.5815 23.8312 2.0932 8.0734 0.4000 3.8325 10.2890 0.1986 9.1107 0.9538 9.8795 2.9542 1.0798 3.9814 2.1857 7.0766 16.1689 2.7940 52.6186 0.3904 16.1944 23.2050 8.9243 0.3053 20.5626 11.8549 34.0344 0.8772 47.0484 46.5327 8.5588 4.6132 2.9641 0.2273 3.7763 0.0949 0.0702 114.3628 55.9940 60.3493 3.4942 100.0016 40.0139 1.1684 68.8342 131.4966 20.5875 32.6417 43.6500 25.3815 430.2225 30.6561 29.9772 10.6101 35.7305 42.3775 2.5120 50.0809 101.4652 12.8968 0.9061 0.5812 20.4011 6.3751 12.2521 60.4934 18.3126 143.1568 12.7955 2.6217 85.0270 11.6385 68.3729 184.6837 28.6045 272.7230 293.3298 63.5598 549.9505 241.6710 324.3636 48.7962 27.4720 23.0334 40.3803 54.6924 33.1223 89.9606 42.1937 29.6242 28.3569 32.5725 44.0578 5.4980 56.3178 1.0816 12.0102 34.6722 24.3533 26.9180 6.0926 1.6387 9.1791 44.6227
temp: 298.150 k
press: 1.00000 atm
elementType: 8 8 8 7 7 7 6 6 6 6 6 6 6 6 6 6 6 6 6 6 6 6 6 6 1 1 1 1 1 1 1 1 1 1 1 1 1 1 1 1 1 1 1 1 1 1 1
symmnumber: 1
zpe: 1006002.7 jmol-1
zpe.correction: 0.383166 hartree
zpe.thermalcorrener: 0.406171 hartree
zpe.thermalcorrenthalpy: 0.407115 hartree
zpe.thermalcorrgfe: 0.331762 hartree
zpe.sumelectzpe: -1087.860255 hartree
zpe.sumelectthermal: -1087.837250 hartree
zpe.sumelectthermalent: -1087.836306 hartree
zpe.sumelectthermalfe: -1087.911659 hartree
dipole: 4.8155 -7.7193 0.5023
dipole: 9.1120
quadrupole: -138.4809 -134.4173 -144.8827
quadrupole: 13.6774 -5.5661 4.3510
quadrupole: 0.7794 4.8430 -5.6224 13.6774 -5.5661 4.3510
hfenergy: -1088.2434211 hartree
pointgroup: C01 [X(C18H23N3O3)]
dipole: 1.9926274 2.9667844 -0.2820118 debye
polarizability: 375.9172125|-6.3308761|258.8303374|-11.1769207|0.2074259|135.6452672 unknown
InChI: InChI=1S/C18H23N3O3/c1-18(2,3)20-16-10-13-12-9-15(24-5)14(23-4)8-11(12)6-7-21(13)17(22)19-16/h8-10,20H,6-7H2,1-5H3
charge 0 multiplicity 1
47 atoms
O  5.51682 -0.437307 -0.560574
O  4.096356 2.051058 0.120158
O  -2.614407 -3.187719 0.61063
N  -0.737975 -1.824075 0.263281
N  -3.282263 1.403047 -0.14427
N  -2.994264 -0.90652 0.226822
C  0.129376 -3.014208 0.455053
C  1.311422 -2.972053 -0.525582
C  -0.174629 -0.571075 0.036103
C  2.053945 -1.655804 -0.372969
C  1.301142 -0.486416 -0.072475
C  -4.779171 1.420877 -0.094861
C  -1.023755 0.524114 -0.106251
C  -2.449642 0.312618 0.000237
C  3.447951 -1.555582 -0.521012
C  1.983942 0.746175 0.09358
C  -2.184359 -2.019448 0.378602
C  -5.276303 0.942539 1.294638
C  -5.19266 2.895634 -0.326742
C  -5.363803 0.523098 -1.216911
C  4.139131 -0.329169 -0.375465
C  3.38234 0.846082 -0.050509
C  6.440165 0.707404 -0.449903
C  3.332948 3.244555 0.484723
H  -0.518342 -3.892577 0.30705
H  0.496024 -3.032563 1.500707
H  0.93111 -3.083492 -1.561044
H  1.9838 -3.82642 -0.331647
H  -0.620472 1.509527 -0.348975
H  -2.826989 2.301413 -0.312693
H  4.050434 -2.439177 -0.754979
H  1.4117 1.634921 0.371255
H  -4.882678 1.592883 2.097335
H  -6.380779 0.974871 1.327722
H  -4.942972 -0.091788 1.47438
H  -4.848223 3.259534 -1.313985
H  -6.292024 2.983165 -0.301327
H  -4.783403 3.555984 0.462023
H  -5.0398 -0.519107 -1.068452
H  -5.0248 0.867864 -2.211085
H  -6.468253 0.562435 -1.190317
H  6.41963 1.139975 0.563418
H  6.196421 1.489101 -1.187466
H  7.427709 0.269815 -0.663039
H  2.810808 3.109942 1.45204
H  2.59946 3.510056 -0.301624
H  4.081229 4.045614 0.5767
