program: Gaussian 09
title: 000189883
version: EM64L-G09RevD.01
frameworkgroup: C1[X(C12H8Cl2N2O)]
method: RPBEPBE
basis: SDD
operation: Freq
keyword: #p
keyword: freq=noraman
keyword: PBEPBE/SDD
title: #p freq=noraman PBEPBE/SDD
converged: NO YES NO NO
title: Mulliken charges:
elementType: Cl Cl O N N C C C C C C C C C C C C H H H H H H H H
charge: 0.002481 -0.012029 -0.301445 -0.235550 -0.348568 0.208405 0.265945 0.366324 0.061067 -0.414417 -0.251459 -0.321353 0.100762 -0.658957 -0.251394 -0.101355 -0.224389 0.244286 0.238487 0.243034 0.304271 0.243037 0.258692 0.246999 0.337125
chargesum: 0.00000
title: Mulliken charges with hydrogens summed into heavy atoms:
elementType: Cl Cl O N N C C C C C C C C C C C C
charge: 0.002481 -0.012029 -0.301445 -0.235550 -0.011443 0.208405 0.265945 0.366324 0.061067 -0.170131 -0.251459 -0.082866 0.100762 0.131385 0.007298 -0.101355 0.022610
polarizability: 2.72339568e+02 -1.75127435e+00 1.91160562e+02 6.23462453e-04 1.46309005e-03 6.60136309e+01
1716.lowfreq: -4.1879 -3.3669 -0.0023 0.0014 0.0015 4.5333 56.5167 62.1486 89.9586
frequency: 56.4835 62.1444 89.9511 146.7202 148.4918 193.6009 197.9758 204.5454 247.8423 263.0855 284.8691 308.4214 314.7420 353.5043 401.1800 442.4432 484.4469 508.5468 533.2859 547.9680 585.0184 585.2093 621.2515 623.5805 634.4109 716.2716 724.8544 744.6494 761.6458 776.0838 791.5745 810.8793 884.6591 911.7725 943.6050 949.2188 1030.6562 1061.5624 1100.0725 1126.0973 1128.3217 1148.9187 1166.4788 1215.3658 1261.4597 1272.7190 1334.7394 1374.5735 1386.5403 1404.4304 1418.1006 1422.7875 1463.9876 1478.1337 1487.8027 1494.1733 1532.8168 1547.3090 1600.3652 1622.0858 1639.9769 3002.3791 3103.7084 3112.5862 3151.9369 3173.5080 3178.5390 3197.5393 3520.3046
redmass: 7.5147 7.6801 4.6809 9.9085 4.8493 3.4948 27.2728 1.1942 5.1223 8.3701 15.4037 5.8304 3.4652 5.7647 8.6941 7.6161 8.0157 4.6682 6.5278 4.2807 5.3299 6.1374 5.5105 3.5113 6.9630 1.4893 7.1862 3.1915 3.4384 1.6738 7.6839 1.8010 5.0199 1.2882 1.3503 7.2285 6.9877 2.4014 2.1939 1.9259 1.2894 1.6581 2.0198 1.5370 4.4813 3.1028 1.8068 3.1784 3.3626 2.4041 3.3529 3.0572 3.7938 1.8333 1.2601 1.0442 6.4624 7.0022 4.6640 7.2821 7.1313 1.0330 1.1026 1.1037 1.0889 1.0879 1.0969 1.1005 1.0775
irintensity: 0.0011 0.4111 8.2612 0.5239 5.2856 0.0729 0.0200 0.8248 0.5364 5.5021 0.3960 0.0096 6.5626 4.5075 8.8476 14.7417 3.3443 0.0036 9.5610 1.4984 1.4170 0.0470 2.4990 10.0912 5.2722 112.1058 12.6075 5.3218 23.4373 54.8410 5.8318 21.5662 81.2666 1.0305 0.4337 23.3306 18.2429 87.5362 7.1954 19.1291 0.1240 6.6650 33.0347 29.7759 10.5954 24.9374 18.7581 42.9654 6.2961 21.4508 32.1624 7.4851 24.2536 47.6657 44.3319 19.8580 26.5635 9.9698 86.3267 54.0296 411.2384 44.1765 17.0429 4.1119 2.9285 0.0346 3.4843 10.0649 76.4203
temp: 298.150 k
press: 1.00000 atm
elementType: 17 17 8 7 7 6 6 6 6 6 6 6 6 6 6 6 6 1 1 1 1 1 1 1 1
symmnumber: 1
zpe: 460651.5 jmol-1
zpe.correction: 0.175453 hartree
zpe.thermalcorrener: 0.189553 hartree
zpe.thermalcorrenthalpy: 0.190498 hartree
zpe.thermalcorrgfe: 0.134116 hartree
zpe.sumelectzpe: -1565.774716 hartree
zpe.sumelectthermal: -1565.760616 hartree
zpe.sumelectthermalent: -1565.759671 hartree
zpe.sumelectthermalfe: -1565.816053 hartree
dipole: -2.7183 -3.7108 0.0001
dipole: 4.5999
quadrupole: -107.1811 -103.6816 -115.0747
quadrupole: 12.6128 -0.0009 -0.0009
quadrupole: 1.4647 4.9642 -6.4289 12.6128 -0.0009 -0.0009
hfenergy: -1565.9501691 hartree
pointgroup: C01 [X(C12H8Cl2N2O1)]
dipole: -0.9805666 1.5210542 -0.0000343 debye
dipolederiv: -0.1653527 0.1697202 0.0000035 0.2834658 -0.5875475 -0.0000124 0.0000082 -0.0000094 -0.0095059 -0.8764756 0.0240518 0.0000242 0.1120303 -0.067183 -0.0000037 0.0000273 -0.0000026 -0.0361752 -0.8208797 -0.3731822 0.0000701 -0.4965722 -1.2706628 0.0001712 -0.0002454 -0.0004325 -0.3671258 -0.7682229 0.1268127 0. -0.0355925 -0.6416827 -0.0000081 0.0000689 -0.0000349 -0.1503526 -0.4680631 0.3325634 0.0000325 -0.4647003 -0.5198263 -0.0001204 -0.0000702 0.0000715 -0.2852771 -0.0375309 0.2962465 -0.0000049 -0.3329059 -0.0934197 -0.0000065 0.0000031 -0.0000159 -0.016961 0.4415526 -0.3153768 0.0000024 0.2982742 0.0320683 -0.0000783 0.0000938 0.0000186 -0.007265 0.3620062 0.2710293 0.0000205 0.7261066 -0.0651422 -0.0000097 0.0000475 0.0000171 0.1147128 -0.3090146 -0.8244675 -0.0000187 -0.8151074 0.0731048 0.0000486 -0.0000519 -0.0000103 0.0360567 0.2692629 -0.0870056 -0.0000114 0.1872919 0.04369 0.0000105 -0.0000545 0.000014 -0.144318 -0.0128068 -0.4019167 -0.0000109 -0.3805411 0.7877518 0.0000116 -0.000009 0.0000217 -0.0959807 -0.1763808 0.1644225 -0.0000344 -0.2119257 -0.0417696 -0.0000077 -0.0000424 -0.0000486 -0.2043599 1.0773867 0.45202 -0.0000624 0.5599737 1.5630979 -0.0001131 0.0002508 0.0003613 0.169403 -0.0634308 -0.0014365 0.0000105 -0.0128494 0.4697404 0.0000188 0.0000271 0.0000071 0.2021677 -0.4455756 0.0855122 0.000004 0.147061 -0.0814716 -0.0000094 -0.0000004 0.0000031 -0.1257564 1.1020511 0.0403909 -0.0000316 -0.2545929 0.0820471 0.0000151 -0.0000435 0.000001 -0.0558124 0.2157337 -0.0088661 0.0000573 0.6263179 0.1198645 0.0000349 -0.0000423 -0.0000254 -0.0956148 0.0597784 0.0781386 0.0000055 0.0337627 -0.0526123 -0.0000064 0.0000117 -0.0000009 0.1588547 0.0861733 -0.0597127 0.0000036 0.0077119 -0.0463408 0.0000144 -0.0000062 0.0000281 0.1745298 0.0839015 0.0918214 -0.0921091 0.0152736 -0.013497 0.0135439 -0.068023 0.0680801 -0.0421077 0.0987267 -0.1550562 -0.0000005 0.003253 0.1458855 -0.0000057 0.0000087 -0.0000082 0.1326648 0.0839127 0.0917784 0.0921039 0.0152601 -0.0134939 -0.0135327 0.0680064 -0.0680849 -0.0421389 0.0131049 -0.0661694 0.0000033 -0.0545882 0.0172129 -0.0000014 0.0000145 -0.0000064 0.169838 -0.0137197 0.0788505 -0.0000358 0.0651174 0.015327 0.0000202 0.0000327 0.0000297 0.1910841 0.2638625 -0.0101686 -0.0000217 -0.0215244 0.1448592 0.0000265 -0.000012 0.0000268 0.3294398 unknown
polarizability: 272.2597314|-3.0889501|191.2403983|-0.0005352|0.0014976|66.0136309 unknown
InChI: InChI=1S/C12H8Cl2N2O/c1-16-10-6(2-3-8(13)9(10)14)7-4-5-15-12(17)11(7)16/h2-5,15H,1H3
charge 0 multiplicity 1
25 atoms
Cl 2.854657 -2.361222 -0.000031
Cl 4.929428 0.114663 -0.000059
O  -3.291426 -1.974979 -0.00011
N  -0.291096 -1.190111 0.000044
N  -3.708598 0.326849 -0.000007
C  0.405231 1.019307 0.000108
C  -1.039777 1.001085 0.000106
C  0.842034 -0.360145 0.000043
C  -1.429561 -0.363764 0.000198
C  1.344426 2.077695 0.000103
C  2.231398 -0.654724 0.000008
C  -2.021683 2.046325 0.000056
C  -2.821629 -0.786043 0.000391
C  -0.334163 -2.668844 -0.000089
C  2.713731 1.776275 0.000051
C  3.140926 0.420247 0.00001
C  -3.35294 1.673348 -0.000085
H  1.01297 3.120543 0.000129
H  -1.746996 3.102681 -0.000012
H  0.165708 -3.07007 0.896249
H  -1.393392 -2.968151 -0.00003
H  0.165583 -3.06991 -0.896569
H  3.469191 2.566282 0.000038
H  -4.175967 2.391416 -0.000266
H  -4.697657 0.059045 -0.000176
