program: Gaussian 09
title: 000189839
version: EM64L-G09RevD.01
frameworkgroup: C1[X(C16H21NO2S)]
method: RPBEPBE
basis: SDD
operation: Freq
keyword: #p
keyword: freq=noraman
keyword: PBEPBE/SDD
title: #p freq=noraman PBEPBE/SDD
converged: YES YES NO NO
title: Mulliken charges:
elementType: S O O N C C C C C C C C C C C C C C C C H H H H H H H H H H H H H H H H H H H H H
charge: 0.147840 -0.315430 -0.462215 -0.312203 -0.114852 -0.388182 -0.303481 -0.312862 0.279037 0.128061 0.430444 -0.665162 -0.381848 -0.361957 -0.453677 -0.422376 -0.240720 -0.247593 -0.239140 -0.842062 0.222501 0.193714 0.198182 0.220018 0.243631 0.293741 0.201990 0.219477 0.243303 0.263209 0.254728 0.256908 0.238073 0.346853 0.238358 0.225425 0.228227 0.227472 0.254997 0.253116 0.254453
chargesum: 0.00000
title: Mulliken charges with hydrogens summed into heavy atoms:
elementType: S O O N C C C C C C C C C C C C C C C C
charge: 0.147840 -0.315430 -0.115362 -0.018462 0.107649 0.003714 0.160168 0.108606 0.279037 0.128061 0.430444 -0.158650 -0.127120 -0.105049 -0.215604 -0.184018 -0.015295 -0.019366 -0.011668 -0.079495
polarizability: 2.27610911e+02 8.78994550e+00 2.62397873e+02 2.95968717e+01 2.01019411e+01 1.33328120e+02
1716.lowfreq: -6.4679 -0.0012 -0.0004 0.0009 2.0559 4.6439 13.2222 19.0163 23.9380
frequency: 12.9241 18.9935 23.9210 45.8347 56.6332 65.8263 80.5781 105.6931 115.6916 145.6407 150.6438 158.1970 173.5905 185.2424 195.0407 224.7085 240.9113 260.8078 270.1975 313.5976 367.5138 416.5813 421.6660 441.2047 461.9650 472.1169 489.2702 509.6258 546.1924 572.9695 608.6928 640.7734 665.1175 716.4406 720.1759 733.9339 743.6071 781.1017 782.9838 797.1206 807.4741 852.1533 866.1970 892.5771 897.3578 923.2828 958.8895 962.1729 963.5174 972.4208 976.1462 987.6285 994.7513 1001.4208 1023.4303 1050.5891 1057.4320 1072.9394 1086.3235 1090.6121 1110.8284 1146.7689 1148.3986 1155.0851 1171.7846 1186.5783 1196.0725 1219.8260 1232.2680 1239.7715 1248.5498 1262.0521 1268.2171 1276.4979 1289.2997 1326.8812 1344.1263 1352.2874 1375.4491 1387.2823 1404.5256 1412.3098 1427.2724 1439.9945 1449.3073 1451.7745 1454.2738 1462.3450 1463.5356 1472.3138 1483.7357 1495.2764 1517.6066 1584.2506 1596.9234 1635.8943 2861.2027 2877.5359 2967.8536 2974.8755 2990.1681 2994.5354 2998.7860 3012.2216 3050.5426 3081.4203 3109.2046 3122.5027 3127.8312 3130.0485 3134.9414 3150.9047 3152.7895 3166.7431 3171.3161 3439.2870 3575.6808
redmass: 4.4559 5.4017 3.9166 4.3957 3.5739 3.3664 3.0327 3.5808 2.2362 1.9385 3.7630 1.6521 2.9369 4.0007 4.6090 4.3947 4.6523 2.5313 1.4132 4.0750 4.6292 3.0750 3.1302 3.2330 3.7526 3.3289 5.1213 6.9189 5.7869 3.2867 6.5152 3.2709 6.9723 5.6209 4.7178 1.3445 1.3222 1.6826 5.3020 1.1235 1.8651 5.0229 1.4415 1.6301 2.1319 1.4432 4.5308 1.2389 1.3849 1.4646 1.3762 3.0564 1.3256 1.6217 2.5455 2.3420 2.4053 2.6012 2.0340 2.2400 1.8158 1.5877 1.4696 1.9003 1.0771 1.2665 1.3147 1.3655 1.7735 2.2588 1.2322 1.2446 1.7707 1.1483 1.2045 1.2548 1.1812 1.2942 2.2108 1.4851 3.1349 1.7257 5.2243 2.4504 1.0534 1.8291 1.2414 1.0839 1.1470 1.1180 1.1309 1.0837 3.7920 7.0771 5.6372 7.0019 1.0692 1.0705 1.0856 1.0603 1.0843 1.0592 1.0320 1.0847 1.1073 1.1059 1.1057 1.0858 1.1021 1.0863 1.0894 1.0942 1.0948 1.0994 1.0960 1.0745 1.0664
irintensity: 0.2949 0.0962 2.0767 1.5136 0.1553 0.8067 0.5683 3.5858 2.0338 3.7619 1.5644 3.5473 12.9760 0.0694 3.3464 0.5448 12.1781 28.8835 119.3119 5.3938 0.7283 9.7542 6.8724 1.6093 13.3500 0.3072 6.9982 1.9344 10.4186 12.0764 6.3103 1.0665 2.1578 19.1974 11.4784 79.6967 14.8870 82.0545 1.0081 3.4216 72.5169 5.2178 0.4545 5.0129 18.3191 0.4774 63.7412 9.6360 3.9728 13.3780 4.6930 43.9872 0.0762 17.3835 20.8882 8.8032 63.4569 9.0637 27.5600 42.9185 1.0342 60.6049 24.2793 16.3541 1.0684 11.2260 16.7376 14.7734 36.8012 99.7129 11.6691 7.8471 45.9214 1.4460 0.6794 4.4995 2.6647 4.5960 32.2075 6.2431 27.6123 3.0253 27.0411 5.7179 15.9420 46.7750 25.4829 0.4135 42.8153 11.6322 10.5143 2.9396 25.7684 72.2566 6.2577 4.9223 66.4288 98.7856 51.5916 31.0456 44.5024 31.3291 31.1551 40.9173 39.1147 38.7296 22.7217 0.7809 13.6431 1.4402 11.8518 19.8415 39.7350 27.2032 9.1452 42.1058 8.8048
temp: 298.150 k
press: 1.00000 atm
elementType: 16 8 8 7 6 6 6 6 6 6 6 6 6 6 6 6 6 6 6 6 1 1 1 1 1 1 1 1 1 1 1 1 1 1 1 1 1 1 1 1 1
symmnumber: 1
zpe: 884942.3 jmol-1
zpe.correction: 0.337057 hartree
zpe.thermalcorrener: 0.358122 hartree
zpe.thermalcorrenthalpy: 0.359067 hartree
zpe.thermalcorrgfe: 0.283263 hartree
zpe.sumelectzpe: -1224.031541 hartree
zpe.sumelectthermal: -1224.010475 hartree
zpe.sumelectthermalent: -1224.009531 hartree
zpe.sumelectthermalfe: -1224.085334 hartree
dipole: 0.4788 -0.1261 -0.7524
dipole: 0.9007
quadrupole: -127.3295 -112.3503 -131.0585
quadrupole: -3.1659 11.5085 1.9604
quadrupole: -3.7501 11.2291 -7.4791 -3.1659 11.5085 1.9604
hfenergy: -1224.3685977 hartree
pointgroup: C01 [X(C16H21N1O2S1)]
dipole: 0.1487808 -0.0281182 -0.3203693 debye
polarizability: 232.7866195|9.3164786|261.4121219|15.37182|25.5113512|129.138162 unknown
InChI: InChI=1S/C16H21NO2S/c1-20-10-9-17-11-14(18)12-19-16-8-4-6-13-5-2-3-7-15(13)16/h2-8,14,17-18H,9-12H2,1H3
charge 0 multiplicity 1
41 atoms
S  -5.203909 -1.600213 1.319262
O  0.414792 1.297742 -0.506219
O  -0.979439 4.670821 -0.421285
N  -2.472224 1.220862 -0.003407
C  -1.078174 3.207447 -0.582262
C  -2.176775 2.62552 0.336581
C  0.344703 2.743058 -0.240376
C  -3.543024 0.602024 0.804464
C  1.634685 0.642015 -0.2695
C  1.645938 -0.758326 -0.617914
C  2.852676 -1.517433 -0.368845
C  -3.870201 -0.791402 0.244446
C  2.766238 1.263662 0.270722
C  0.511595 -1.409759 -1.20173
C  3.999615 -0.86253 0.194099
C  2.866035 -2.912767 -0.700687
C  3.952029 0.497268 0.498194
C  0.559725 -2.771252 -1.516036
C  1.744336 -3.530458 -1.258995
C  -5.371447 -3.218765 0.375057
H  -1.316419 2.928768 -1.629902
H  -1.870898 2.783238 1.402083
H  -3.105413 3.21587 0.183473
H  0.563039 2.951588 0.826306
H  1.073445 3.282437 -0.874911
H  -1.60914 0.659731 -0.014768
H  -3.284186 0.514512 1.888864
H  -4.443441 1.243669 0.740106
H  -2.974663 -1.441152 0.260999
H  -4.242004 -0.708727 -0.790728
H  2.761147 2.326332 0.5275
H  -0.3843 -0.819813 -1.418181
H  4.909814 -1.444198 0.377569
H  -1.848288 5.080762 -0.65987
H  3.778941 -3.489407 -0.509735
H  4.828609 0.998055 0.92326
H  -0.30978 -3.260399 -1.968865
H  1.769726 -4.597071 -1.508201
H  -4.416703 -3.769471 0.384498
H  -6.141327 -3.809639 0.895433
H  -5.692335 -3.028698 -0.6621
