program: Gaussian 09
title: 000189837
version: EM64L-G09RevD.01
frameworkgroup: C1[X(C19H20N2O2)]
method: RPBEPBE
basis: SDD
operation: Freq
keyword: #p
keyword: freq=noraman
keyword: PBEPBE/SDD
title: #p freq=noraman PBEPBE/SDD
converged: YES YES NO NO
title: Mulliken charges:
elementType: O O N N C C C C C C C C C C C C C C C C C C C H H H H H H H H H H H H H H H H H H H H
charge: -0.415463 -0.228806 -0.414545 -0.057286 -0.441976 -0.352891 -0.396397 0.297646 -0.363276 0.242112 0.212140 -0.488261 -0.099292 -0.092289 -0.340498 -0.295305 -0.314377 -0.321050 -0.288730 -0.300193 -0.236218 -0.233835 0.174553 0.223122 0.210033 0.175913 0.201616 0.261517 0.202448 0.220275 0.220024 0.294393 0.253509 0.252256 0.182064 0.240589 0.264829 0.264047 0.225083 0.224798 0.230074 0.229151 0.378497
chargesum: 0.00000
title: Mulliken charges with hydrogens summed into heavy atoms:
elementType: O O N N C C C C C C C C C C C C C C C C C C C
charge: -0.036966 -0.228806 -0.120152 -0.057286 -0.008821 0.024638 0.067568 0.297646 0.077022 0.242112 0.212140 0.017503 -0.099292 -0.092289 -0.158435 -0.054716 -0.049548 -0.057003 -0.063647 -0.075394 -0.006144 -0.004684 0.174553
polarizability: 3.02540131e+02 2.49039627e+01 3.14397724e+02 -5.99343238e+00 3.72163116e+00 1.23348311e+02
1716.lowfreq: -3.9132 -0.0008 0.0006 0.0007 2.6132 7.5222 12.8423 13.7115 21.7933
frequency: 12.7745 13.6490 21.7458 53.4750 56.6690 62.4078 90.6587 100.2339 106.7257 115.7351 128.2554 167.8137 232.7132 241.6143 255.0485 269.9527 304.8967 329.5421 338.9307 394.7565 412.9719 428.3711 434.2581 457.1719 493.4850 501.2475 507.7184 511.8827 547.3259 579.1575 588.5817 596.7193 623.6188 637.4552 641.8695 645.7154 683.8995 725.4330 742.3192 753.6817 763.3756 775.1718 795.7757 829.2980 845.0596 858.6133 863.4258 870.4829 880.7555 902.3932 932.8724 944.3740 955.1957 975.5009 989.5761 990.2540 1012.6556 1024.9884 1027.8858 1055.2773 1071.2041 1078.4475 1104.3059 1106.5529 1109.4982 1128.8468 1148.3256 1160.5007 1172.9085 1195.6713 1218.2759 1228.1214 1239.0570 1248.7714 1253.1161 1275.6123 1281.4408 1286.9326 1292.5717 1300.8233 1327.7399 1343.1405 1359.2875 1365.5226 1375.0067 1379.6502 1402.9911 1434.8288 1438.4626 1442.8385 1450.6321 1456.8026 1465.9135 1468.0467 1482.1993 1485.7825 1505.1197 1527.0253 1554.6568 1558.5666 1612.0860 1629.2771 1669.1716 2941.8420 2947.2920 2980.0633 2988.2224 2996.4617 2999.4287 3031.8953 3041.9497 3046.0364 3064.6500 3101.2731 3129.3032 3133.2817 3146.4131 3151.7289 3167.0838 3169.1623 3182.2413 3514.3353 3553.1606
redmass: 8.3170 6.5717 5.8152 3.3296 3.6740 2.4368 3.7070 3.2421 5.4446 3.2607 2.1641 4.4360 4.7201 3.6314 3.3168 3.8950 5.2648 3.0249 4.5128 6.0669 3.3387 3.5520 4.9662 2.3190 3.4966 1.8382 2.5738 1.9737 4.1478 3.5374 4.8359 5.6485 4.9161 1.3236 4.6679 4.6691 4.4672 1.1364 3.3750 1.4649 1.4278 1.4512 2.6265 4.0385 3.6026 1.7244 3.3640 2.2240 1.8193 3.4768 2.7972 1.3714 1.3675 1.9559 1.3266 1.3235 3.8001 2.2425 2.0542 3.2656 2.1861 2.4461 1.8954 2.8208 2.1986 1.7879 1.3201 1.1994 1.3414 1.7317 1.3057 1.4121 1.3571 2.2063 1.5719 1.5743 1.5842 1.6621 1.1968 1.3765 1.4923 1.6647 1.7823 1.5143 1.8458 3.4732 3.6681 2.6543 1.0854 2.4803 2.7357 1.0988 1.2884 1.7246 1.1041 1.1206 3.4109 6.3274 5.0219 3.7963 5.5395 6.4426 8.2957 1.0677 1.0610 1.0607 1.0614 1.0884 1.0672 1.0989 1.0985 1.0989 1.1031 1.0863 1.0858 1.0879 1.0904 1.0940 1.0969 1.0993 1.0946 1.0640 1.0741
irintensity: 1.4515 0.6894 0.4145 0.4793 0.5669 0.8381 1.5562 0.6362 1.9686 0.7850 1.0414 3.1018 0.1849 0.5323 5.3216 0.3172 0.3107 1.7417 7.3152 2.3444 6.4224 8.0940 0.1714 9.3895 26.0907 28.1240 10.3328 18.2419 12.8090 10.5258 13.7015 2.8529 15.4767 125.8437 24.8213 17.4867 3.8999 15.1094 5.7907 70.5671 77.3008 2.2576 8.3755 0.1661 1.7107 3.8215 5.0950 5.6164 6.5637 1.7357 1.5186 0.7237 1.0448 14.7581 0.0649 1.2633 136.1854 3.4757 14.8339 130.8334 5.2392 8.7909 0.5695 20.8547 5.2885 33.2390 14.6514 1.4582 2.8332 2.5180 12.9343 0.9241 3.2759 6.2776 6.1321 18.0058 7.0379 5.7948 2.6870 16.5748 35.8565 36.4801 5.0954 5.9610 47.0598 50.4645 36.6521 38.3655 32.1222 27.1413 0.6786 13.2598 22.2675 27.6203 17.5112 51.5051 289.6209 49.3100 158.1013 12.8866 32.2608 12.5747 211.5985 56.5231 33.2647 26.4250 5.8892 10.2047 32.8097 1.9024 24.0929 31.2308 68.9525 16.6741 7.0507 13.5911 15.2997 24.9211 25.6155 27.9283 24.7398 22.4475 37.7394
temp: 298.150 k
press: 1.00000 atm
elementType: 8 8 7 7 6 6 6 6 6 6 6 6 6 6 6 6 6 6 6 6 6 6 6 1 1 1 1 1 1 1 1 1 1 1 1 1 1 1 1 1 1 1 1
symmnumber: 1
zpe: 915292.6 jmol-1
zpe.correction: 0.348617 hartree
zpe.thermalcorrener: 0.369511 hartree
zpe.thermalcorrenthalpy: 0.370455 hartree
zpe.thermalcorrgfe: 0.294723 hartree
zpe.sumelectzpe: -994.343136 hartree
zpe.sumelectthermal: -994.322241 hartree
zpe.sumelectthermalent: -994.321297 hartree
zpe.sumelectthermalfe: -994.397029 hartree
dipole: 4.6038 -1.2061 -1.2503
dipole: 4.9207
quadrupole: -144.0424 -120.2545 -146.0966
quadrupole: 6.8065 -9.7783 1.2046
quadrupole: -7.2446 16.5433 -9.2988 6.8065 -9.7783 1.2046
hfenergy: -994.6917523 hartree
pointgroup: C01 [X(C19H20N2O2)]
dipole: -1.8288879 -0.4406562 0.4570524 debye
polarizability: 302.8042836|-24.5636722|312.2181394|3.2785291|-20.5106346|125.2637434 unknown
InChI: InChI=1S/C19H20N2O2/c22-18(23)12-2-1-7-13-20-19-14-8-3-5-10-16(14)21-17-11-6-4-9-15(17)19/h3-6,8-11,20,22H,1-2,7,12-13H2
charge 0 multiplicity 1
43 atoms
O  -7.814575 0.559108 0.555793
O  -7.196357 -0.266373 -1.524648
N  -0.009355 -0.468247 0.179187
N  4.104979 0.752126 -0.138878
C  -2.01594 -1.436029 -0.93487
C  -3.089671 -0.882996 0.032964
C  -0.64904 -1.7209 -0.272135
C  1.333772 -0.110782 0.107673
C  -4.457936 -0.693301 -0.657888
C  1.66924 1.286911 -0.069196
C  2.413241 -1.058849 0.22214
C  -5.527522 -0.148702 0.30744
C  3.074257 1.65667 -0.162817
C  3.779016 -0.565863 0.047299
C  0.686017 2.329753 -0.183293
C  2.240302 -2.447764 0.564197
C  3.420619 3.045922 -0.313323
C  4.871301 -1.503142 0.10855
C  1.054723 3.666704 -0.331713
C  3.324862 -3.318169 0.649677
C  2.440519 4.030803 -0.387811
C  4.655441 -2.8470 0.392948
C  -6.884877 0.019499 -0.348379
H  -1.87446 -0.73899 -1.78492
H  -2.38624 -2.388197 -1.363857
H  -2.768449 0.090689 0.462093
H  -3.195613 -1.578071 0.89155
H  0.018186 -2.219923 -0.997573
H  -0.807408 -2.421932 0.575309
H  -4.353729 -0.005354 -1.518566
H  -4.800967 -1.65741 -1.079198
H  -0.661678 0.304689 0.311112
H  -5.655775 -0.819431 1.180006
H  -5.229999 0.831757 0.728166
H  -0.386644 2.097045 -0.173686
H  1.246751 -2.830474 0.805656
H  4.487807 3.28182 -0.368846
H  5.873865 -1.096593 -0.056179
H  0.284703 4.441084 -0.418324
H  3.162914 -4.365532 0.927155
H  2.721111 5.083687 -0.501854
H  5.499351 -3.543797 0.446265
H  -8.69594 0.654059 0.101871
