program: Gaussian 09
title: 000189836
version: EM64L-G09RevD.01
frameworkgroup: C1[X(C20H29NO3S)]
method: RPBEPBE
basis: SDD
operation: Freq
keyword: #p
keyword: freq=noraman
keyword: PBEPBE/SDD
title: #p freq=noraman PBEPBE/SDD
converged: YES YES NO NO
title: Mulliken charges:
elementType: S O O O N C C C C C C C C C C C C C C C C C C C C H H H H H H H H H H H H H H H H H H H H H H H H H H H H H
charge: 0.981268 -0.571045 -0.512360 -0.512426 -0.430061 -0.384906 -0.380124 -0.381816 -0.367023 -0.373227 -0.461280 -0.353448 -0.354484 -0.356650 0.495508 -0.695811 0.452036 -0.655265 0.398214 -0.378288 -0.428011 -0.404353 -0.411303 -0.096898 -0.247602 0.194586 0.194614 0.194429 0.194762 0.192886 0.192972 0.196973 0.197182 0.190320 0.190342 0.211520 0.213381 0.188148 0.188098 0.218667 0.218517 0.195149 0.195112 0.305809 0.209772 0.216207 0.209812 0.232289 0.251117 0.244228 0.289578 0.246770 0.279005 0.377109
chargesum: 0.00000
title: Mulliken charges with hydrogens summed into heavy atoms:
elementType: S O O O N C C C C C C C C C C C C C C C C C C C C
charge: 0.981268 -0.193936 -0.512360 -0.512426 -0.124252 0.004294 0.009067 0.004042 0.027132 0.007435 -0.036379 0.022799 0.082701 0.033611 0.495508 -0.060020 0.452036 -0.422976 0.398214 -0.127172 -0.183783 -0.114775 -0.164532 -0.096898 0.031403
polarizability: 4.97405947e+02 -6.72056887e-01 2.34796129e+02 -1.72805342e+00 7.87628254e-01 1.63923491e+02
1716.lowfreq: -0.0021 -0.0005 0.0005 3.4924 4.0939 11.5927 12.5418 17.6328 28.1416
frequency: 12.0571 17.5905 27.9179 33.7330 47.6203 52.5096 54.6546 75.7776 78.8912 98.0431 106.7338 113.3599 116.1236 130.7821 133.1563 143.6597 153.9080 157.0147 162.2604 195.4272 200.1569 210.1856 224.6541 227.9319 255.9469 289.8858 296.6227 312.3821 329.9835 370.4924 389.3598 394.8819 397.3767 418.6454 431.8609 447.8425 470.6702 484.1225 503.2303 514.7485 527.8373 571.4831 599.3616 636.9597 667.4767 722.5876 725.5276 735.7788 749.2189 758.1483 772.7961 786.4132 797.1186 808.2617 819.7961 830.6118 851.6050 882.4011 883.6833 887.8046 913.3462 919.0347 939.8313 963.5227 969.3058 974.7368 976.5332 984.2813 1001.9507 1025.5810 1026.0574 1043.4181 1053.6952 1055.1144 1065.3994 1079.9652 1080.5807 1082.9394 1104.7666 1126.5981 1146.4313 1156.2804 1162.7185 1185.7230 1207.4011 1213.1703 1215.1233 1232.8661 1245.8012 1246.5108 1272.6506 1274.3472 1278.9268 1281.1697 1290.8692 1291.4955 1301.0707 1301.3808 1303.8247 1324.8387 1339.5462 1345.1552 1353.3820 1356.2867 1359.1170 1366.0947 1384.0195 1388.0148 1432.1121 1446.2012 1451.9358 1461.7250 1461.7874 1465.0767 1466.7774 1470.5548 1475.4847 1475.8766 1481.0073 1486.3034 1489.7681 1496.4521 1502.7228 1527.3299 1576.4937 1600.6155 1642.1174 2936.8344 2950.9187 2951.2592 2953.4576 2956.1130 2959.3958 2963.1164 2968.9075 2970.7443 2971.8675 2976.5367 2984.4103 2989.1994 2996.1081 3005.2613 3015.7525 3027.3961 3038.2408 3046.5557 3068.2953 3071.1841 3113.2730 3133.5334 3137.7026 3146.2823 3165.1782 3169.2240 3478.8746 3557.6622
redmass: 5.6809 4.9491 4.9712 4.9423 1.8206 4.5431 3.6957 2.6151 1.9576 5.3835 2.3169 3.8684 2.5910 2.6548 4.8498 2.4750 2.1980 1.6141 2.2331 3.4311 3.9074 5.3153 1.1356 5.8681 3.5884 3.8763 5.0974 6.8594 5.1718 3.8093 3.9529 1.8566 4.1040 2.1276 5.2661 4.2483 2.5207 3.0595 3.9203 6.2249 7.4695 4.0212 5.7455 7.0118 3.3907 1.0591 1.0711 1.0920 5.8553 1.1256 2.3423 5.2166 1.1838 1.3361 1.5431 11.8279 1.2117 2.5040 3.0354 1.9244 1.2327 1.4386 3.9668 14.8723 1.3848 1.3367 1.2177 5.0129 4.0868 2.3077 1.3209 1.2250 3.1203 2.2082 2.9609 2.0479 2.3515 2.3778 2.6368 3.0982 1.6670 1.5135 1.2636 1.7446 1.3648 1.4195 1.4523 1.4491 1.3184 1.3141 1.2220 1.4485 1.4810 1.0202 1.0857 1.1091 1.0923 1.1188 1.3707 1.5009 1.6236 1.7649 1.7393 1.7154 1.6897 1.8999 2.0495 1.2172 6.3530 4.3965 2.3359 1.0729 1.0739 1.0657 1.0770 1.0785 1.0810 1.0426 1.0885 1.0969 1.0979 1.7973 1.3856 3.1462 6.1413 6.4646 6.4290 1.0570 1.0587 1.0588 1.0592 1.0592 1.0591 1.0589 1.0587 1.0583 1.0366 1.1027 1.0964 1.0979 1.1000 1.1024 1.1043 1.1051 1.1050 1.1048 1.1007 1.0993 1.0911 1.0886 1.0890 1.0924 1.0955 1.0964 1.0660 1.0767
irintensity: 0.4981 0.4410 0.5164 1.4923 0.0664 0.3386 0.3437 0.1537 0.2157 0.0480 0.9878 0.5888 0.1289 0.2161 0.1725 1.6215 0.3798 47.5605 6.7180 3.6755 2.4888 9.9951 0.0023 3.4894 21.0174 14.5508 25.1766 10.2034 10.8130 14.9629 8.6498 39.1117 45.4469 37.2732 47.6125 16.7655 18.1827 0.1372 3.9447 1.2786 184.2387 61.3406 9.6374 22.7301 10.9226 17.3678 0.1863 6.3360 7.0401 0.1965 1.0551 15.5601 5.6819 9.7960 19.2778 116.2921 1.6703 45.4317 31.3217 3.9038 2.6110 15.7333 4.5859 88.4421 2.1072 4.2598 0.2567 0.0010 0.0777 0.2678 0.1443 65.4263 28.0740 104.2062 1.9053 0.6746 0.8969 0.8633 2.1137 10.3127 16.2353 0.1413 28.3674 0.0828 6.1230 43.1319 0.1846 32.1625 2.8621 0.1571 0.1894 2.8651 3.9533 0.2020 0.2461 0.0855 0.0024 0.2550 3.8624 16.5268 5.9065 82.5383 40.9207 2.9433 4.4923 6.1677 50.2589 10.9640 8.4694 28.5823 16.4139 0.0222 0.1393 0.1269 1.6939 10.1966 3.1277 12.5123 17.1954 6.3248 35.0850 308.4785 17.6495 46.6056 22.9667 4.8116 625.3292 60.9691 0.0619 0.1794 0.2460 0.4558 5.6454 10.5406 19.8333 258.7624 39.1003 18.4081 0.0180 0.0711 0.5201 1.4643 0.6650 7.2497 16.7320 249.4428 100.4818 54.9385 17.6276 4.6889 8.4661 2.1738 18.6864 5.0643 37.2089 75.0277
temp: 298.150 k
press: 1.00000 atm
elementType: 16 8 8 8 7 6 6 6 6 6 6 6 6 6 6 6 6 6 6 6 6 6 6 6 6 1 1 1 1 1 1 1 1 1 1 1 1 1 1 1 1 1 1 1 1 1 1 1 1 1 1 1 1 1
symmnumber: 1
zpe: 1180843.2 jmol-1
zpe.correction: 0.449759 hartree
zpe.thermalcorrener: 0.478022 hartree
zpe.thermalcorrenthalpy: 0.478967 hartree
zpe.thermalcorrgfe: 0.387121 hartree
zpe.sumelectzpe: -1455.942685 hartree
zpe.sumelectthermal: -1455.914422 hartree
zpe.sumelectthermalent: -1455.913478 hartree
zpe.sumelectthermalfe: -1456.005324 hartree
dipole: 10.0177 1.4257 1.3224
dipole: 10.2047
quadrupole: -221.4880 -153.8377 -166.2743
quadrupole: -5.8717 -15.9014 -1.1535
quadrupole: -40.9547 26.6956 14.2590 -5.8717 -15.9014 -1.1535
hfenergy: -1456.3924445 hartree
pointgroup: C01 [X(C20H29N1O3S1)]
dipole: 3.9376749 -0.5699196 -0.5373338 debye
polarizability: 497.406627|-0.889458|234.7084896|1.5369307|2.6233224|164.0104504 unknown
InChI: InChI=1S/C20H29NO3S/c1-2-3-4-5-6-7-8-9-14-21-19-12-10-18-16-20(25(22,23)24)13-11-17(18)15-19/h10-13,15-16,21-22H,2-9,14H2,1H3
charge 0 multiplicity 1
54 atoms
S  -8.092181 0.462508 0.1301
O  -8.37807 0.500393 -1.714857
O  -9.019205 -0.71733 0.742063
O  -8.217535 1.976211 0.692893
N  0.108614 -0.706175 -0.00089
C  6.403363 0.436906 -0.000431
C  5.152741 -0.470528 -0.009175
C  7.730582 -0.354551 -0.018718
C  3.825745 0.321018 0.012812
C  8.982998 0.55079 -0.012143
C  2.580846 -0.593044 -0.002273
C  10.310341 -0.240621 -0.028949
C  1.26207 0.203857 0.028036
C  11.563058 0.665176 -0.022573
C  -1.221035 -0.311256 0.024719
C  12.884515 -0.133371 -0.039588
C  -3.628279 -0.882131 0.012681
C  -2.261507 -1.270107 -0.011603
C  -3.968117 0.53064 0.079192
C  -1.570136 1.090054 0.089387
C  -2.902027 1.48833 0.116153
C  -5.338607 0.927202 0.102635
C  -4.695095 -1.84969 -0.01941
C  -6.313478 -0.063354 0.06936
C  -6.031299 -1.456773 0.004625
H  6.370374 1.116249 -0.877827
H  6.378261 1.088423 0.898081
H  5.178312 -1.119658 -0.909312
H  5.18863 -1.151197 0.866955
H  7.755787 -1.007516 -0.916289
H  7.764866 -1.032969 0.859448
H  3.799779 0.965711 0.915605
H  3.792922 1.003828 -0.861243
H  8.950159 1.228634 -0.890876
H  8.958248 1.204572 0.884898
H  2.603886 -1.228446 -0.911724
H  2.615924 -1.275974 0.871404
H  10.345451 -0.918319 0.849851
H  10.337265 -0.894568 -0.925855
H  1.230309 0.894408 -0.841779
H  1.233796 0.831519 0.944124
H  11.535348 1.318139 0.873741
H  11.527141 1.342056 -0.900657
H  0.307844 -1.705679 -0.050546
H  12.950408 -0.771001 -0.941495
H  13.763994 0.536564 -0.034603
H  12.958789 -0.795266 0.843994
H  -2.013311 -2.338271 -0.059969
H  -0.778404 1.844027 0.117626
H  -3.149836 2.554924 0.166506
H  -5.616748 1.98528 0.161443
H  -4.444605 -2.915439 -0.064922
H  -6.849454 -2.182763 -0.006666
H  -9.349135 0.701481 -1.855758
