program: Gaussian 09
title: 000189819
version: EM64L-G09RevD.01
frameworkgroup: C1[X(C8H5N5O)]
method: RPBEPBE
basis: SDD
operation: Freq
keyword: #pfreq=noraman
keyword: PBEPBE/SDD
title: #p freq=noraman PBEPBE/SDD
converged: YES YES NO NO
title: Mulliken charges:
elementType: O N N N N N C C C C C C C C H H H H H
charge: -0.243347 -0.067125 0.055867 -0.004023 0.015455 -0.045014 0.315462 -0.331406 -0.304344 0.274606 -0.327879 -0.368568 0.110943 -0.348655 0.286694 0.216164 0.248053 0.257181 0.259936
chargesum: 0.00000
title: Mulliken charges with hydrogens summed into heavy atoms:
elementType: O N N N N N C C C C C C C C
charge: -0.243347 -0.067125 0.055867 -0.004023 0.015455 -0.045014 0.315462 -0.044712 -0.088180 0.274606 -0.079826 -0.111387 0.110943 -0.088719
polarizability: 3.02280113e+02 1.36774559e+01 1.13233587e+02 7.15859602e-01 2.85286500e-01 4.71427111e+01
1716.lowfreq: -7.3674 -0.8050 -0.0011 -0.0009 -0.0007 7.4178 15.3774 48.2635 81.0611
frequency: 15.0611 48.2557 81.0606 86.9359 123.6052 143.3853 191.5252 290.3451 302.5034 359.1552 405.5815 415.3635 453.9881 459.2101 491.9288 522.1398 531.5038 556.9053 627.1147 655.2808 688.8755 763.6011 778.6022 829.0799 849.6298 857.3677 961.7415 990.7376 996.7365 1010.2821 1098.0783 1120.4995 1165.6997 1198.1092 1229.2115 1308.7101 1328.0305 1362.6624 1375.2810 1425.5947 1493.3764 1524.3116 1575.5427 1610.9227 2046.5008 2057.2244 3136.7729 3148.7412 3164.9042 3175.4448 3208.8767
redmass: 5.7413 6.6242 10.2942 7.4288 10.1642 8.0149 9.4884 9.5747 7.1011 8.0264 2.8355 9.2931 7.5171 12.9245 3.6826 2.5642 7.2884 1.9744 7.2214 9.7682 3.7927 3.9470 7.6066 1.3206 6.2988 1.6737 1.3940 5.2953 1.3668 2.8466 4.5583 1.3678 1.8840 1.3661 2.3862 1.3082 6.2195 3.6545 3.8623 4.0659 2.5968 10.0303 7.0798 6.3680 13.8591 13.2009 1.0896 1.0878 1.0952 1.0967 1.0892
irintensity: 5.1677 3.8836 0.9163 0.3259 0.1236 0.4017 8.4293 1.3412 0.6339 0.6014 0.2371 0.9859 2.0693 0.8102 9.6338 15.3145 27.1135 16.3728 1.4465 1.6020 43.5001 35.3959 14.7408 8.0089 31.3960 49.8344 0.6151 55.2059 1.1597 10.6651 22.6165 36.5986 24.1186 52.2454 140.7439 10.9437 115.1357 258.5762 377.1208 34.7754 16.0508 97.0799 32.0156 200.1303 1075.0895 232.4275 4.2645 14.9537 4.3983 5.6946 2.6177
temp: 298.150 k
press: 1.00000 atm
elementType: 8 7 7 7 7 7 6 6 6 6 6 6 6 6 1 1 1 1 1
symmnumber: 1
zpe: 324439.2 jmol-1
zpe.correction: 0.123572 hartree
zpe.thermalcorrener: 0.135828 hartree
zpe.thermalcorrenthalpy: 0.136773 hartree
zpe.thermalcorrgfe: 0.082726 hartree
zpe.sumelectzpe: -655.762568 hartree
zpe.sumelectthermal: -655.750312 hartree
zpe.sumelectthermalent: -655.749367 hartree
zpe.sumelectthermalfe: -655.803414 hartree
dipole: -0.4626 3.3987 -0.2212
dipole: 3.4372
quadrupole: -96.2287 -76.2721 -81.2600
quadrupole: 10.9713 -0.7870 0.2596
quadrupole: -11.6418 8.3149 3.3269 10.9713 -0.7870 0.2596
hfenergy: -655.88614 hartree
pointgroup: C01 [X(C8H5N5O1)]
dipole: 0.2293301 -0.4330183 1.2603906 debye
dipolederiv: -0.7214299 0.0603433 -0.2091638 -0.0624619 -0.398012 0.1563155 0.0796251 0.1743687 -0.8220027 -1.681752 -0.1179418 0.3642943 -0.2450116 -0.1614065 0.0930827 0.879218 0.1018347 -0.4835793 2.304616 0.1025034 -0.1286839 -0.2487628 0.1172779 0.1064835 0.8950263 0.1373562 -0.1517848 1.6311827 0.2061564 -0.7202669 0.4262182 0.1326048 -0.1405887 -1.6130573 -0.1573769 0.60874 -1.4356427 -0.1018496 0.1848967 0.1329186 -0.0441801 -0.0280218 -0.4846898 -0.0463521 0.0363074 -1.1473807 -0.0979844 0.3195769 -0.2151179 -0.0922629 0.0550948 0.7933345 0.063726 -0.2755355 -0.9952816 -0.0035543 -0.0430926 0.0015988 -0.0306142 0.0200437 -0.111928 0.0247641 -0.1043473 0.2438086 -0.0058112 0.047962 0.063324 -0.0764327 -0.0394032 -0.1594816 -0.0387155 0.063321 0.3411722 0.0129476 -0.039617 -0.0603757 -0.1130934 -0.0423801 0.1593938 -0.0396691 0.0673735 1.6299337 0.0370816 -0.04941 0.0264187 0.1215707 -0.0166376 -0.0016397 -0.0147678 0.180619 -0.4405485 0.0112359 -0.0700882 0.087086 -0.156289 -0.0269549 -0.3646542 -0.0327504 -0.0596743 -0.5603364 -0.0249116 0.0733983 -0.0829946 -0.1494114 -0.0460785 0.3148891 -0.0419541 0.0350703 2.2984034 0.0785968 -0.0565253 0.3683814 0.3264279 -0.2476414 -0.7928045 -0.2845849 0.9538981 -1.8001718 -0.1383176 0.2745943 -0.1571097 -0.3052184 -0.0596889 0.3186153 -0.0598448 -0.1620589 0.137208 0.0126031 -0.0533993 -0.0029524 0.1449885 0.0302598 -0.0160929 0.0274129 0.034015 0.0089682 -0.0283199 0.1121547 -0.0319159 0.1347932 0.0393419 0.1242834 0.0382801 -0.0077431 -0.0307277 -0.0239055 0.0827015 -0.019088 0.1595607 0.0360667 0.0576888 0.0361724 0.0266006 0.0620491 0.014042 -0.0631244 0.0172764 0.1591662 0.040817 -0.0675707 0.0411598 -0.0059008 0.1559296 0.0070858 -0.0262074 0.0025684 0.2305307 0.0698897 -0.0101557 0.0709407 0.066682 unknown
polarizability: 301.0372138|10.033681|52.0563265|-18.0700828|-17.337637|109.5628707 unknown
InChI: InChI=1S/C8H5N5O/c9-11-5-8(14)6-1-3-7(4-2-6)12-13-10/h1-5H
charge 0 multiplicity 1
19 atoms
O  -2.516885 0.496146 -1.620413
N  3.574902 -0.042645 0.538325
N  -4.336681 -0.226167 0.343645
N  4.45159 0.19169 -0.346478
N  -5.466075 -0.141576 0.023202
N  5.417501 0.373177 -1.009851
C  -0.63036 0.06465 -0.165332
C  0.262773 0.348116 -1.23513
C  -0.085957 -0.241744 1.111519
C  2.179613 0.01078 0.235255
C  1.653163 0.322913 -1.048904
C  1.304521 -0.269144 1.314916
C  -2.100098 0.121702 -0.475237
C  -3.034333 -0.279469 0.592853
H  -0.172044 0.58858 -2.210653
H  -0.734964 -0.451382 1.967586
H  2.325712 0.5420 -1.886219
H  1.730897 -0.500724 2.295102
H  -2.742476 -0.642804 1.576816
