program: Gaussian 09
title: 000189811
version: EM64L-G09RevD.01
frameworkgroup: C1[X(C12H20N2O7)]
method: RPBEPBE
basis: SDD
operation: Freq
keyword: #p
keyword: freq=noraman
keyword: PBEPBE/SDD
title: #p freq=noraman PBEPBE/SDD
converged: YES YES NO NO
title: Mulliken charges:
elementType: O O O O O O O N N C C C C C C C C C C C C H H H H H H H H H H H H H H H H H H H H
charge: -0.448888 -0.273191 -0.421388 -0.239171 -0.565361 -0.391503 -0.252880 -0.116093 -0.387946 -0.147737 -0.510720 -0.368491 -0.406017 -0.539192 -0.040070 0.202059 -0.337397 0.175070 -0.418443 -0.091409 0.152975 0.236076 0.239644 0.254701 0.190684 0.229552 0.224465 0.195945 0.239301 0.260876 0.260152 0.290980 0.203696 0.239988 0.229225 0.230512 0.426827 0.308747 0.371226 0.395806 0.397387
chargesum: 0.00000
title: Mulliken charges with hydrogens summed into heavy atoms:
elementType: O O O O O O O N N C C C C C C C C C C C C
charge: -0.022061 -0.273191 -0.050161 -0.239171 -0.169555 0.005884 -0.252880 -0.116093 -0.096966 0.088339 -0.016375 0.051745 0.014394 -0.039015 0.220082 0.202059 0.106287 0.175070 0.041295 0.217339 0.152975
polarizability: 1.95952259e+02 -1.75817480e+00 1.56281782e+02 -4.50449888e+00 -1.19008112e+00 1.45157197e+02
1716.lowfreq: -10.2821 -0.0004 -0.0004 0.0002 2.1120 5.9038 25.1369 33.7438 49.1725
frequency: 24.9826 33.6998 49.1647 50.0064 58.2483 71.7356 76.1444 99.2454 107.5178 125.0606 141.3427 149.7462 169.0895 188.9971 193.4376 236.5845 246.8587 277.3055 294.8936 315.7449 323.3945 336.3399 366.9726 372.9359 412.4942 449.9144 456.2802 483.6593 506.4423 512.6705 554.5828 566.7402 575.3745 612.0653 616.9551 619.2055 629.5152 685.0226 692.3361 709.4073 766.8152 797.7823 819.0569 828.1170 857.3940 908.6419 908.8827 932.8904 943.5383 954.7257 960.7674 996.5206 999.1952 1018.3284 1039.4722 1048.9905 1054.2821 1076.8306 1081.5083 1090.4660 1106.5969 1116.6214 1134.5403 1155.0537 1165.3305 1180.4753 1181.4393 1203.0713 1209.2461 1221.7435 1228.5234 1243.6428 1254.2953 1261.3797 1268.4172 1287.1142 1292.6846 1313.9868 1325.1587 1343.2352 1344.6695 1350.8230 1363.3496 1366.7951 1383.5374 1400.4530 1438.3908 1450.1189 1457.7726 1461.3338 1465.9917 1470.3711 1488.3225 1499.0885 1627.1174 1630.8422 1658.8371 2773.7465 2870.2651 2882.5455 2919.8703 2926.5784 2954.9111 2993.6318 3001.7335 3004.9105 3016.8766 3019.7011 3045.5382 3056.0565 3068.8352 3071.6384 3133.8913 3426.8586 3498.1890 3500.9631 3519.3448
redmass: 6.5218 6.5236 8.1027 5.4955 7.4055 4.7643 7.7368 5.5442 5.6569 6.0785 3.5251 5.7518 3.8433 4.7848 4.7774 2.9915 2.4859 3.3233 4.4556 3.0482 3.8484 4.2443 2.7138 3.3474 4.3138 2.1706 3.2615 2.0002 2.4330 2.5788 1.4311 1.9118 3.0104 3.5716 1.7675 2.8340 1.8993 3.4599 4.2105 3.9259 2.7208 3.0697 2.8763 1.4882 2.3038 2.8466 2.4283 2.4672 2.3842 2.7463 3.0570 2.6139 1.3805 2.2169 2.8067 2.8168 2.6917 1.9335 2.3202 2.3329 2.5963 1.6409 2.0169 3.0469 2.3912 1.4365 2.6279 1.1613 1.1795 1.2924 1.3761 1.3735 1.5127 1.4272 1.2161 1.5196 1.4639 1.2566 1.3160 1.4914 1.5975 1.4472 1.3501 1.3717 1.2951 1.7268 1.0902 1.3111 1.2251 1.1292 1.0956 1.1323 1.1136 1.0753 5.3130 8.1418 8.1623 1.0722 1.0699 1.0721 1.0821 1.0676 1.0839 1.0791 1.0690 1.0781 1.0719 1.0853 1.0901 1.0661 1.1015 1.1021 1.1087 1.0648 1.0640 1.0757 1.0643
irintensity: 0.6287 0.6675 0.8820 0.0436 0.4579 4.2858 1.5113 0.4360 2.5826 1.5103 0.7680 4.3127 0.1634 5.3256 6.4635 9.2321 17.2213 4.3754 0.6789 2.6290 1.4950 9.0960 2.3269 10.2671 26.4255 40.5038 6.3913 40.9579 10.6711 60.7671 60.0661 72.7782 22.7408 21.2511 38.0698 33.7623 192.2636 51.4239 11.8357 33.4962 3.0420 0.5444 11.4822 2.3752 13.1928 2.2619 49.2584 9.2974 6.0444 24.5322 32.8112 70.6285 136.7195 11.0614 94.0527 91.1952 294.6345 12.2608 17.1557 70.0243 6.8725 28.3890 18.9115 69.7227 133.9702 14.6603 34.4103 3.6346 3.6319 20.9292 55.8582 33.5814 18.0393 6.0491 5.3833 66.8688 5.3902 9.4084 26.6907 6.8334 40.8891 5.2780 8.9792 17.7788 1.0300 33.8729 19.5090 19.4838 8.8773 5.3107 4.1812 32.5365 0.4111 5.0597 183.9813 188.8675 239.2113 1392.3514 93.1424 57.6563 9.3616 107.6978 59.4709 70.0626 5.7051 8.9783 29.0990 33.6910 34.9664 37.0956 14.1790 6.7234 20.6519 106.6777 15.0263 8.5132 46.7941
temp: 298.150 k
press: 1.00000 atm
elementType: 8 8 8 8 8 8 8 7 7 6 6 6 6 6 6 6 6 6 6 6 6 1 1 1 1 1 1 1 1 1 1 1 1 1 1 1 1 1 1 1 1
symmnumber: 1
zpe: 858397.0 jmol-1
zpe.correction: 0.326946 hartree
zpe.thermalcorrener: 0.348856 hartree
zpe.thermalcorrenthalpy: 0.349801 hartree
zpe.thermalcorrgfe: 0.274493 hartree
zpe.sumelectzpe: -1103.668631 hartree
zpe.sumelectthermal: -1103.646721 hartree
zpe.sumelectthermalent: -1103.645777 hartree
zpe.sumelectthermalfe: -1103.721084 hartree
dipole: 2.3917 -0.9108 -1.5954
dipole: 3.0158
quadrupole: -102.4898 -125.0033 -128.2995
quadrupole: 12.0447 -2.8243 -8.4032
quadrupole: 16.1077 -6.4058 -9.7019 12.0447 -2.8243 -8.4032
hfenergy: -1103.9955772 hartree
pointgroup: C01 [X(C12H20N2O7)]
dipole: 0.7724932 0.538282 0.7220283 debye
polarizability: 189.5759089|14.1749679|162.2579592|5.4224589|3.6882935|145.5573704 unknown
InChI: InChI=1S/C12H20N2O7/c15-9(12(20)21)1-4-13-7(10(16)17)2-5-14-6-3-8(14)11(18)19/h7-9,13,15-16,18,20H,1-6H2
charge 0 multiplicity 1
41 atoms
O  -0.64161 1.935691 -1.072142
O  -0.416711 1.808079 1.234214
O  -0.137113 -4.009828 0.281721
O  -1.310308 -4.016603 -1.714726
O  1.886568 1.443757 -1.17144
O  4.514812 1.603905 1.36508
O  4.307425 2.464251 -0.786218
N  -2.964898 0.033454 0.409511
N  0.542942 -1.351008 -0.763844
C  -2.63742 1.500027 0.195738
C  -3.456348 1.824985 1.482521
C  -4.096317 0.404915 1.334027
C  -3.198616 -0.848658 -0.748923
C  -1.878234 -1.171834 -1.486679
C  -0.841832 -1.843331 -0.551307
C  -1.139532 1.780127 0.201976
C  1.378476 -1.256107 0.450085
C  -0.825042 -3.366089 -0.762807
C  2.696606 -0.492349 0.209359
C  2.520746 1.043708 0.106084
C  3.854177 1.780713 0.166012
H  -3.08724 1.914991 -0.732092
H  -4.133493 2.689055 1.425776
H  -2.797903 1.905227 2.361056
H  -5.084965 0.442599 0.822568
H  -4.173512 -0.224102 2.237263
H  -3.656573 -1.780836 -0.362265
H  -3.923715 -0.404054 -1.475624
H  -1.461779 -0.228425 -1.883726
H  -2.09482 -1.828208 -2.348506
H  -1.15285 -1.646938 0.499897
H  0.586531 -0.521096 -1.363832
H  0.82698 -0.766606 1.29052
H  1.623837 -2.280077 0.788341
H  3.193446 -0.869868 -0.704702
H  3.367871 -0.686241 1.066508
H  0.394514 1.88999 -1.100764
H  1.850454 1.402395 0.912618
H  -0.090199 -4.984486 0.080229
H  2.569588 1.922369 -1.721181
H  5.378858 2.098405 1.364376
