program: Gaussian 09
title: 000189807
version: EM64L-G09RevD.01
frameworkgroup: C1[X(C25H30O4)]
method: RPBEPBE
basis: SDD
operation: Freq
keyword: #pfreq=noraman
keyword: PBEPBE/SDD
title: #p freq=noraman PBEPBE/SDD
converged: YES YES NO NO
title: Mulliken charges:
elementType: O O O O C C C C C C C C C C C C C C C C C C C C C C C C C H H H H H H H H H H H H H H H H H H H H H H H H H H H H H H
charge: -0.449183 -0.285812 -0.242574 -0.231005 0.318401 -0.244444 -0.153776 -0.209748 0.121123 -0.506013 -0.493184 -0.515249 -0.072468 -0.610114 -0.771809 0.162138 -0.623016 0.369544 -0.785866 0.277225 0.196836 -0.628232 -0.480613 0.322041 0.093916 -0.553797 -0.799197 0.269381 -0.758224 0.219690 0.196248 0.269634 0.232982 0.224279 0.241048 0.217492 0.215430 0.237302 0.234803 0.244731 0.253852 0.234982 0.207464 0.223163 0.226448 0.225893 0.233254 0.215812 0.211658 0.335901 0.268016 0.318770 0.282804 0.243847 0.244463 0.260336 0.259328 0.251708 0.252382
chargesum: 0.00000
title: Mulliken charges with hydrogens summed into heavy atoms:
elementType: O O O O C C C C C C C C C C C C C C C C C C C C C C C C C
charge: -0.113282 -0.285812 -0.242574 -0.231005 0.318401 -0.024754 0.042472 0.059886 0.121123 -0.048752 -0.034644 -0.062517 0.162335 -0.111530 -0.106201 0.162138 -0.170675 0.369544 -0.125141 0.277225 0.196836 -0.360216 -0.161844 0.322041 0.093916 -0.270993 -0.050551 0.269381 0.005193
polarizability: 3.78342072e+02 1.31484379e+01 2.82776217e+02 3.03907318e+00 7.05384960e+00 1.91411690e+02
1716.lowfreq: -44.4687 -15.9004 -5.5679 -0.0006 0.0002 0.0006 1.2183 19.9732 25.5738
frequency: -44.4566 19.8764 24.7291 33.2353 47.5557 61.8638 70.6551 89.3329 98.7618 102.8360 115.7464 131.7524 143.2252 146.5256 160.7063 180.2545 191.0348 200.6797 203.4635 205.1712 222.0244 229.9420 231.7392 254.6962 263.9026 283.7737 302.7302 323.0201 333.0883 346.1105 363.3755 379.5765 388.7018 398.5428 411.6071 424.7708 435.6178 459.1747 474.9018 488.4086 501.8456 512.5992 546.5084 562.2443 562.8523 577.9707 584.4162 593.2658 601.9338 627.5833 635.6439 643.0500 661.2304 663.4196 683.3046 703.1846 735.3914 762.6278 780.0130 808.9450 821.5191 843.8666 854.1176 866.0204 874.9655 894.7142 918.6402 922.8749 929.3295 934.6632 946.2992 964.5355 967.9341 978.1378 990.4985 997.7172 1005.7013 1021.4328 1024.2889 1025.6093 1039.0925 1044.9941 1053.9792 1065.7076 1075.5101 1087.2750 1105.9114 1119.8541 1127.9425 1133.4829 1149.6753 1153.3778 1164.9175 1173.0124 1192.0125 1194.1605 1201.9702 1211.9967 1227.8080 1232.3009 1251.9374 1264.3186 1272.5485 1274.6810 1281.6377 1292.3963 1297.4546 1308.0854 1312.8665 1315.8924 1330.4323 1336.2015 1341.5662 1343.7596 1360.5751 1365.6734 1372.0147 1378.7042 1382.3119 1385.0604 1390.3943 1417.1651 1439.0148 1453.9658 1454.9869 1456.1543 1457.2935 1458.4169 1464.0622 1467.6466 1469.0809 1471.3159 1474.9471 1479.7336 1487.2259 1487.4173 1568.6295 1583.0989 1602.4280 1646.1552 2145.5275 2920.9071 2943.2666 2963.2421 2967.7859 2984.9008 2987.6757 2988.3759 2989.7877 2994.8060 3003.7884 3008.3540 3016.9515 3018.5558 3029.6139 3044.6657 3054.4572 3056.1731 3066.8221 3074.9494 3076.0762 3080.9930 3088.1755 3093.8357 3094.9848 3124.4469 3143.5861 3143.8906 3231.0419 3430.9278 3544.2339
redmass: 1.0749 6.6880 3.5867 4.9940 4.6985 3.6036 3.6688 2.5779 3.7945 4.1387 3.0710 3.2580 2.0804 2.5727 2.5169 1.4351 2.1000 2.0720 2.5388 1.4143 2.2989 2.0646 3.7618 3.5891 2.2269 2.7852 3.9495 3.0893 3.6218 4.3780 2.7432 3.4916 3.5357 3.6350 3.4678 3.9047 3.2327 3.6875 4.3707 4.5785 3.7520 3.5804 3.7566 4.8392 3.3413 3.5043 4.1746 4.2009 4.5261 3.0313 1.2409 3.8485 3.2202 1.2628 4.3657 4.4226 2.9487 2.1098 3.4832 2.2755 2.8211 2.4725 2.8342 2.5558 2.5368 2.2263 1.8526 1.4038 1.7020 2.1953 2.2797 2.8075 2.0837 1.9743 2.2718 2.7531 2.2104 1.9070 1.8492 2.0115 3.2833 1.6040 2.2863 2.1921 2.0175 2.7132 1.5686 2.3392 1.8643 2.4938 2.3155 2.0253 2.2357 3.8104 1.9374 1.6765 2.2091 1.5370 1.4844 1.3130 1.3992 1.4110 2.7987 1.5417 1.4498 1.4250 1.3191 1.6610 1.4161 1.3063 1.5043 1.6050 1.5471 1.5645 1.5094 1.5624 1.2341 2.6596 1.2663 1.2184 1.2383 3.6134 2.2529 1.0632 1.0984 1.1122 1.2386 1.0461 1.0817 1.0720 1.0492 1.0785 1.0605 1.0608 1.0508 1.0869 6.6800 6.7869 6.9019 10.7009 6.0622 1.0817 1.0653 1.0767 1.0436 1.0531 1.0460 1.0720 1.0374 1.0741 1.0613 1.0368 1.0932 1.0825 1.0622 1.0991 1.0984 1.1015 1.0975 1.0970 1.0971 1.0975 1.1031 1.0992 1.0971 1.0996 1.0938 1.0990 1.0910 1.1596 1.0655
irintensity: 1.4859 0.2687 0.4449 4.7510 0.5377 3.8389 2.0902 14.6092 1.3694 2.9313 3.1957 6.8112 19.6536 35.5581 1.3152 52.1467 10.4655 2.3598 8.0531 1.6071 3.0990 1.6755 5.6451 1.1872 0.2788 0.1632 0.1953 3.2136 1.1966 4.4345 0.5031 0.3720 2.1521 0.4895 1.0289 1.3742 0.3180 2.9829 5.4054 6.8267 0.6640 3.9962 3.1596 8.6776 3.1251 1.8335 12.0955 1.3778 7.5559 0.3269 69.3687 0.6222 1.3659 58.6833 3.4630 11.3819 3.8208 2.1339 0.6946 14.0461 5.2418 22.1219 16.9141 6.2257 2.1763 32.4552 32.0395 23.5780 7.8693 9.3195 10.3671 31.6038 8.8913 7.1301 2.2544 21.0533 134.3562 3.7976 1.3489 17.9536 20.0406 9.2620 35.1061 10.7757 2.4737 0.5319 43.1997 1.3589 16.1715 0.8598 7.6298 34.0508 36.2954 642.2963 15.8396 26.6522 54.4915 0.9566 17.1474 4.6400 4.7471 2.7194 133.4145 30.0793 1.6524 0.8853 10.4201 18.2917 2.0626 2.3657 23.9437 18.5421 18.4363 2.8747 3.4913 3.6710 35.9402 8.1133 21.8040 60.2678 14.8599 23.8733 106.3969 11.4719 19.9529 9.7726 13.5602 17.6443 12.9493 1.2994 17.9174 3.4271 12.2503 13.8984 24.5419 11.1001 100.7786 96.7958 1.8850 194.0983 1.7458 26.6378 19.3596 12.2005 57.4857 20.8146 12.2216 26.3371 2.8335 20.2121 36.6534 3.4733 14.8674 21.3999 27.8039 31.1234 47.8447 10.0573 23.2123 48.1616 9.0494 23.9320 28.6977 33.2012 5.4502 14.7955 1.8578 9.2644 6.5824 69.2179 9.4602
temp: 298.150 k
press: 1.00000 atm
elementType: 8 8 8 8 6 6 6 6 6 6 6 6 6 6 6 6 6 6 6 6 6 6 6 6 6 6 6 6 6 1 1 1 1 1 1 1 1 1 1 1 1 1 1 1 1 1 1 1 1 1 1 1 1 1 1 1 1 1 1
symmnumber: 1
zpe: 1280237.7 jmol-1
zpe.correction: 0.487617 hartree
zpe.thermalcorrener: 0.515947 hartree
zpe.thermalcorrenthalpy: 0.516891 hartree
zpe.thermalcorrgfe: 0.429184 hartree
zpe.sumelectzpe: -1269.345422 hartree
zpe.sumelectthermal: -1269.317092 hartree
zpe.sumelectthermalent: -1269.316148 hartree
zpe.sumelectthermalfe: -1269.403855 hartree
dipole: -4.3763 -3.1690 -0.9067
dipole: 5.4787
quadrupole: -175.3017 -168.7306 -168.0851
quadrupole: 9.5077 -6.7263 4.0181
quadrupole: -4.5959 1.9752 2.6207 9.5077 -6.7263 4.0181
hfenergy: -1269.8330389 hartree
pointgroup: C01 [X(C25H30O4)]
dipole: -1.8044615 -1.1613197 -0.2035931 debye
polarizability: 379.6583921|6.7318527|281.4017496|4.4343476|-6.6781418|191.4698371 unknown
InChI: InChI=1S/C25H30O4/c1-6-25(28)10-8-21-22-14(2)11-17-12-18(29-16(4)27)13-20(15(3)26)23(17)19(22)7-9-24(21,25)5/h1,12-14,19,21-22,28H,7-11H2,2-5H3
charge 0 multiplicity 1
59 atoms
O  5.658631 -1.172658 -0.095312
O  -5.288733 -0.506315 0.162445
O  -0.157689 2.712931 -1.085521
O  -6.125864 1.669825 -0.179654
C  3.349724 -0.325539 0.503291
C  2.709257 -1.140515 -0.677322
C  1.161582 -1.321504 -0.644104
C  0.4599 0.043983 -0.382911
C  4.76906 0.029928 -0.112929
C  2.53395 0.975669 0.764904
C  3.201704 -0.424121 -1.983229
C  1.020882 0.710197 0.9124
C  0.62628 -2.415724 0.326388
C  4.458299 0.413879 -1.592086
C  3.521524 -1.12076 1.815891
C  -1.063116 -0.045397 -0.330949
C  -0.884128 -2.59513 0.053695
C  -1.683895 -1.30089 -0.047736
C  1.337391 -3.780655 0.192107
C  5.50195 1.059152 0.636174
C  -1.911748 1.105544 -0.52027
C  -3.084291 -1.386575 0.104655
C  -3.323932 0.994229 -0.369825
C  -3.894741 -0.246756 -0.041877
C  -1.393355 2.46312 -0.934926
C  6.103631 1.92857 1.266528
C  -2.395407 3.588213 -1.207123
C  -6.310389 0.463107 0.086328
C  -7.64792 -0.182004 0.374985
H  3.15761 -2.155236 -0.660484
H  0.87232 -1.659997 -1.666373
H  0.72208 0.740712 -1.198744
H  2.665752 1.696358 -0.065446
H  2.927652 1.468439 1.673752
H  2.415096 0.236748 -2.387784
H  3.42432 -1.166083 -2.772223
H  0.81067 0.074224 1.794037
H  0.505834 1.671525 1.079731
H  0.746694 -2.066136 1.370189
H  5.343168 0.204189 -2.218103
H  4.253305 1.494096 -1.673658
H  4.115091 -0.530106 2.538254
H  2.54936 -1.346972 2.285717
H  4.062892 -2.066563 1.644483
H  -1.331677 -3.242605 0.832757
H  -0.997393 -3.148795 -0.903902
H  2.368425 -3.75404 0.584222
H  0.791301 -4.559804 0.75743
H  1.379584 -4.103889 -0.86691
H  5.32084 -1.803955 -0.782269
H  -3.560386 -2.345284 0.337754
H  -3.970487 1.858455 -0.503318
H  6.635211 2.686915 1.810651
H  -2.980967 3.841627 -0.304161
H  -3.114667 3.316376 -2.000835
H  -1.828162 4.476434 -1.523748
H  -7.545816 -1.260916 0.555811
H  -8.32737 -0.007313 -0.477227
H  -8.101035 0.301899 1.25798
