program: Gaussian 09
title: 000189806
version: EM64L-G09RevD.01
frameworkgroup: C1[X(C20H21N7O5S)]
method: RPBEPBE
basis: SDD
operation: Freq
keyword: #p
keyword: freq=noraman
keyword: PBEPBE/SDD
title: #p freq=noraman PBEPBE/SDD
converged: YES YES NO NO
title: Mulliken charges:
elementType: S O O O O O N N N N N N N C C C C C C C C C C C C C C C C C C C C H H H H H H H H H H H H H H H H H H H H H
charge: 0.207761 -0.396730 -0.290468 -0.271574 -0.409797 -0.250411 -0.430571 -0.038670 0.042374 -0.012668 -0.120249 -0.642326 -0.587526 -0.127979 -0.384485 -0.511743 0.190089 0.138823 0.312713 -0.495353 -0.675311 -0.204175 0.299535 0.224452 -0.360631 -0.371752 -0.242678 -0.218021 -0.071170 -0.454531 -0.039680 0.140914 -0.038972 0.326644 0.239307 0.217942 0.289841 0.260796 0.329789 0.231943 0.227357 0.262895 0.274018 0.285961 0.226062 0.262764 0.245488 0.250244 0.387817 0.377338 0.341303 0.372293 0.344925 0.336084
chargesum: 0.00000
title: Mulliken charges with hydrogens summed into heavy atoms:
elementType: S O O O O O N N N N N N N C C C C C C C C C C C C C C C C C C C C
charge: 0.207761 -0.008914 -0.290468 -0.271574 -0.032459 -0.250411 -0.100783 -0.038670 0.042374 -0.012668 -0.120249 0.071270 0.093484 0.198665 0.072764 0.038894 0.190089 0.138823 0.312713 -0.036053 -0.138397 -0.204175 0.299535 0.224452 -0.074670 -0.145690 0.020085 0.027467 -0.071170 -0.204287 -0.039680 0.140914 -0.038972
polarizability: 4.13103993e+02 -3.72013258e+01 2.12582945e+02 1.46335330e+01 4.34079078e-01 2.63454964e+02
1716.lowfreq: -7.2668 -3.4313 -0.0019 0.0009 0.0011 3.0217 12.6328 20.0150 25.8998
frequency: 12.4530 19.9550 25.7971 37.6720 47.4489 56.0615 61.5159 64.9439 66.7052 80.4877 83.6333 90.4641 100.9426 122.3350 127.3288 153.5319 172.4262 177.9709 189.5632 201.2092 212.2996 225.8877 240.7951 247.2375 281.8054 286.7559 295.6172 310.3786 317.7271 332.3860 357.5826 383.6530 394.7934 406.8472 411.1504 441.4048 464.6696 467.0798 488.1094 492.8759 502.4510 510.1474 528.7559 537.2074 547.8338 551.9486 570.4342 584.3121 588.4120 592.6893 599.2399 610.5108 613.8985 625.3995 629.6279 633.3559 638.7653 665.5089 682.9733 685.4194 694.2076 699.4756 710.3316 740.5569 747.4723 782.0603 807.7064 810.4485 823.0550 834.6828 854.6733 860.3022 873.3239 907.9916 923.8650 938.5343 940.3018 956.7053 972.3562 984.4598 994.9204 1004.6214 1005.7291 1009.9335 1040.3325 1045.6011 1054.3282 1074.9607 1098.0279 1105.2178 1109.3882 1113.0319 1140.4294 1144.9113 1146.6548 1187.6751 1193.9171 1197.3485 1219.3919 1240.3700 1249.2167 1259.1467 1265.3609 1273.4314 1277.6420 1286.7543 1296.2411 1319.5316 1342.2663 1342.7903 1351.4202 1356.1168 1360.4174 1374.6864 1376.1132 1396.1766 1412.8117 1428.7826 1436.5200 1439.7566 1451.4125 1453.9947 1465.9925 1479.1360 1489.2050 1507.3188 1531.3760 1553.0547 1557.3086 1593.7135 1598.0155 1604.3841 1622.7960 1640.7979 1663.3871 2970.3949 3003.1109 3013.1925 3034.0289 3043.0333 3056.5764 3067.1151 3079.2186 3112.2090 3119.3046 3120.0028 3149.7676 3151.6208 3170.5931 3472.2483 3504.3636 3512.4303 3521.0006 3541.4973 3636.3328 3700.4524
redmass: 7.5760 7.1882 7.4069 7.2011 7.8995 6.9168 6.8642 5.9397 8.8073 5.1921 5.7220 7.0197 6.6256 7.3815 6.3048 6.2016 5.9738 3.9140 8.2240 5.7111 6.1049 3.9400 3.4753 3.2027 4.2629 5.4595 5.4182 5.2116 3.2778 4.2708 3.2424 5.4048 3.5467 3.2739 4.4666 5.4578 4.1305 4.0395 2.1723 4.2514 3.3481 7.7617 1.3310 2.7036 5.4388 1.9119 1.8204 2.2614 2.8072 2.5648 4.9252 1.5070 2.2127 3.1551 1.4784 1.5200 5.4926 4.9114 1.4953 4.8144 3.1079 5.3927 3.0792 7.8885 3.8756 2.7031 5.6492 5.2438 8.8698 1.4391 2.9707 1.8755 1.4712 2.9167 2.3363 1.9713 3.1586 1.3826 2.4811 2.4397 1.6918 2.6068 2.5528 3.1537 3.2036 3.0614 3.1142 2.9458 2.3208 2.9849 2.2306 1.5058 1.3644 1.8584 2.2615 1.1447 1.2253 1.3459 1.3543 2.1898 1.3563 3.1077 1.8179 1.7653 1.7880 2.3028 1.2957 1.2854 1.4144 2.4303 1.8260 2.4288 3.9220 7.9288 1.9337 4.0653 3.6434 1.1236 1.0878 1.6299 1.1581 2.1440 1.8941 3.7025 2.2386 3.1775 3.9644 4.5678 4.3150 4.9000 6.0835 1.8783 2.0200 6.6726 7.9831 1.0649 1.0606 1.0633 1.0587 1.0843 1.0949 1.0989 1.1000 1.1064 1.0921 1.0881 1.0953 1.0890 1.0971 1.0455 1.0765 1.0641 1.0640 1.0449 1.1053 1.1057
irintensity: 0.1716 1.5990 0.4481 0.6002 0.2229 0.6107 0.6158 0.5371 1.9853 0.3021 0.5529 7.5009 1.8575 1.8650 6.1170 0.7174 1.6790 1.1124 5.1940 7.5510 6.3977 2.7537 5.0900 2.1901 2.5028 4.7295 0.5522 2.6132 21.6068 0.0638 2.4735 16.0417 2.4580 1.9437 1.5238 1.3955 18.1725 13.4331 28.5581 4.7128 15.5410 0.2251 179.0067 108.1198 3.2142 11.1359 31.2185 18.8593 7.2178 95.2866 5.1717 241.5830 154.0024 9.6220 17.2089 155.1365 1.0514 1.5355 59.6593 22.0805 132.9283 21.4451 14.9490 21.1775 30.9055 28.3960 1.8912 6.3602 9.7060 14.3890 0.4110 9.7624 25.3285 2.5639 3.5338 19.1900 1.5309 0.5915 21.4750 23.7707 6.8578 20.3634 2.6440 3.8559 7.7093 294.8294 132.2592 17.2253 72.2173 4.6144 82.6744 14.5386 2.2592 2.9229 10.4356 12.3879 0.6907 2.7079 7.4164 12.7235 19.1441 5.6947 25.1617 31.3104 10.9158 26.4826 5.4920 55.8140 9.1211 2.6526 10.3691 85.9691 28.1017 77.5018 45.2865 5.2634 93.3994 31.6427 40.4407 13.7949 70.6706 67.5315 73.2845 22.6763 103.2239 114.1974 92.9145 78.9902 169.0979 30.2477 44.7012 818.8698 145.2658 128.9437 196.8198 32.2514 17.6311 24.9399 35.7139 7.7970 9.0638 4.4070 13.8318 9.1881 22.6563 14.0678 7.9542 0.1017 0.9306 138.6172 35.0095 32.1268 28.6670 152.4234 116.4725 58.0138
temp: 298.150 k
press: 1.00000 atm
elementType: 16 8 8 8 8 8 7 7 7 7 7 7 7 6 6 6 6 6 6 6 6 6 6 6 6 6 6 6 6 6 6 6 6 1 1 1 1 1 1 1 1 1 1 1 1 1 1 1 1 1 1 1 1 1
symmnumber: 1
zpe: 1063930.3 jmol-1
zpe.correction: 0.405230 hartree
zpe.thermalcorrener: 0.435930 hartree
zpe.thermalcorrenthalpy: 0.436874 hartree
zpe.thermalcorrgfe: 0.341244 hartree
zpe.sumelectzpe: -1929.856505 hartree
zpe.sumelectthermal: -1929.825805 hartree
zpe.sumelectthermalent: -1929.824860 hartree
zpe.sumelectthermalfe: -1929.920491 hartree
dipole: -0.4365 1.0319 6.0845
dipole: 6.1868
quadrupole: -175.1360 -202.8303 -193.5655
quadrupole: -0.5481 4.7888 5.4227
quadrupole: 15.3746 -12.3197 -3.0549 -0.5481 4.7888 5.4227
hfenergy: -1930.2617348 hartree
pointgroup: C01 [X(C20H21N7O5S1)]
dipole: 0.5269091 -0.0134087 -2.3763352 debye
polarizability: 321.9471687|103.8406751|304.9125527|7.8995891|25.9548175|262.2821809 unknown
InChI: InChI=1S/C20H21N7O5S/c21-16-15-17(27-20(22)26-16)23-9-11(24-15)7-8-33-12-3-1-10(2-4-12)18(30)25-13(19(31)32)5-6-14(28)29/h1-4,9,13,25,28,31H,5-8,21-22H2
charge 0 multiplicity 1
54 atoms
S  -2.635635 -4.578564 -0.067785
O  2.434361 3.604664 -1.490174
O  1.968059 1.735497 -2.780602
O  2.257143 -0.024542 1.75012
O  5.540073 0.826214 2.938642
O  4.487719 2.657378 1.979048
N  2.378226 0.113394 -0.56735
N  -2.82766 -0.784944 -1.264878
N  -3.546634 0.043303 1.390994
N  -1.844935 1.702427 1.332165
N  -0.449656 1.966001 -0.695546
N  -0.782208 0.596619 -2.582217
N  -0.117866 3.271438 1.204918
C  2.98516 1.4522 -0.545667
C  4.542924 1.442218 -0.64703
C  5.193319 0.748236 0.563149
C  2.395489 2.237823 -1.710946
C  1.914153 -0.469973 0.608571
C  0.929759 -1.593703 0.441405
C  -4.466817 -2.635369 -1.201925
C  -3.483608 -3.766621 -1.575131
C  -1.189349 -3.454055 0.146316
C  -3.796089 -1.433662 -0.566858
C  5.010058 1.526748 1.853339
C  0.038142 -1.842173 1.515398
C  0.799959 -2.350416 -0.753172
C  -1.023921 -2.757311 1.366589
C  -0.243942 -3.28579 -0.894128
C  -2.201829 0.257469 -0.636545
C  -4.146963 -0.981661 0.750089
C  -2.522717 0.686432 0.704866
C  -1.122362 0.969582 -1.314771
C  -0.842793 2.273695 0.605634
H  2.713584 1.945621 0.40401
H  4.89092 2.489465 -0.709849
H  4.841913 0.91929 -1.574616
H  4.780852 -0.264212 0.717081
H  6.280123 0.620423 0.395862
H  1.973373 -0.168701 -1.465251
H  -5.244131 -3.027955 -0.522368
H  -4.974927 -2.31761 -2.136386
H  -4.010181 -4.596102 -2.076697
H  -2.687803 -3.390029 -2.237455
H  0.162301 -1.268822 2.439471
H  1.521567 -2.23938 -1.571583
H  -1.747181 -2.897533 2.175806
H  -0.328393 -3.880643 -1.809826
H  -4.949483 -1.489868 1.298371
H  2.041472 4.083175 -2.270164
H  5.362689 1.334396 3.77589
H  -1.306317 -0.170266 -3.004184
H  0.017084 1.03799 -3.043116
H  0.665474 3.692253 0.708933
H  -0.314893 3.501254 2.175853
