program: Gaussian 09
title: 000189769
version: EM64L-G09RevD.01
frameworkgroup: C1[X(C20H27N3O4S)]
method: RPBEPBE
basis: SDD
operation: Freq
keyword: #p
keyword: freq=noraman
keyword: PBEPBE/SDD
title: #p freq=noraman PBEPBE/SDD
converged: NO YES NO NO
title: Mulliken charges:
elementType: S O O O O N N N C C C C C C C C C C C C C C C C C C C C H H H H H H H H H H H H H H H H H H H H H H H H H H H
charge: 0.179229 -0.174406 -0.263089 -0.213871 -0.272300 -0.079451 -0.366415 -0.099463 -0.476259 -0.117266 -0.244473 -0.158879 0.105182 -0.678329 -0.672620 0.271974 0.234187 -0.657136 -0.297908 -0.344586 0.398662 -0.377333 -0.384625 -0.616650 -0.619313 -0.225080 -0.218783 -0.241196 0.329370 0.295683 0.310926 0.230796 0.227686 0.252547 0.237313 0.258490 0.217204 0.351535 0.250233 0.252813 0.227570 0.245365 0.247433 0.204224 0.244623 0.238219 0.218632 0.230635 0.196744 0.235152 0.193891 0.224119 0.230063 0.228830 0.230103
chargesum: 0.00000
title: Mulliken charges with hydrogens summed into heavy atoms:
elementType: S O O O O N N N C C C C C C C C C C C C C C C C C C C C
charge: 0.179229 -0.174406 -0.263089 -0.213871 -0.272300 -0.079451 -0.014881 -0.099463 -0.146888 -0.117266 0.051210 0.152047 0.105182 0.032700 0.040388 0.271974 0.234187 -0.154090 0.175027 0.107070 0.398662 -0.132710 -0.146406 0.029361 0.033849 0.004983 0.010047 -0.011093
polarizability: 2.92952280e+02 6.87540941e+00 2.66197958e+02 -4.89872113e+00 -5.36184752e+00 2.21720466e+02
1716.lowfreq: -12.6951 -2.1848 -0.0015 0.0008 0.0012 5.2696 14.4815 15.7119 21.7029
frequency: 12.1121 14.4637 20.4711 24.9113 25.7693 34.4520 47.9160 50.5373 58.2396 69.1825 71.2010 84.7073 102.0266 117.7186 135.8164 161.1645 185.7905 197.9510 210.0504 214.2234 230.4344 232.1930 246.8531 254.4782 262.4902 277.7327 287.1800 309.7440 317.3290 327.3780 342.6806 349.9112 378.7790 389.8666 402.0266 412.2252 428.1696 457.1534 466.6419 479.7347 506.0863 534.0199 544.1659 569.2166 591.6979 604.0100 617.5805 625.7144 667.8933 681.8362 704.2844 705.3388 719.9885 757.8954 766.9261 794.7550 818.9591 825.9386 832.1067 849.9580 856.9022 875.3790 908.2314 916.0639 918.7092 930.4839 938.9504 944.9865 961.7896 979.4029 985.1615 989.8296 996.7249 1013.3862 1027.3495 1033.6465 1037.8478 1053.4056 1059.9289 1075.6750 1082.3769 1091.2028 1109.3592 1130.0487 1139.1089 1149.4347 1172.3290 1173.5430 1179.4241 1182.4207 1189.5908 1189.7736 1194.3332 1203.0018 1213.2320 1225.5989 1237.6930 1261.0215 1262.8324 1271.1910 1272.8507 1289.3762 1296.2154 1318.4731 1323.8105 1327.5440 1339.0749 1378.1772 1381.1609 1386.9908 1404.8560 1422.0217 1439.8653 1441.5878 1446.3141 1451.4144 1455.4763 1462.5977 1463.9227 1471.1463 1472.5872 1475.3382 1481.6349 1483.2734 1484.1315 1484.9624 1488.2027 1591.0975 1608.8925 1617.1053 1639.7303 1724.4559 2861.0446 2870.3884 2896.8982 2977.9981 2986.5354 3008.6750 3023.3197 3025.0149 3046.2626 3047.0577 3060.0944 3062.2501 3064.2852 3075.2330 3078.6846 3083.0505 3084.9673 3097.6743 3101.9871 3120.6663 3122.1736 3124.7377 3128.7032 3135.7021 3147.8731 3164.8349 3492.6512
redmass: 5.0725 5.4803 4.7157 4.3261 4.0255 2.9114 6.4228 4.1960 6.1685 5.8357 5.5472 2.8016 5.1297 6.2151 5.5691 3.3412 4.1326 2.3032 1.7255 3.1097 1.1230 2.0511 2.2896 2.5015 4.4221 1.1381 3.3459 3.2326 2.1026 3.3397 5.8541 2.9772 4.4596 3.0640 2.8104 2.7037 4.7432 4.3148 4.0357 5.8958 3.9355 4.3569 4.5780 4.1547 4.9564 4.8808 6.3797 4.1368 1.4948 3.0886 4.2148 1.7861 4.7672 2.9640 3.3728 1.7102 3.1909 3.6828 3.9429 4.2775 1.2511 5.2416 3.0698 2.2702 2.7779 1.7866 2.2801 1.7706 3.5971 1.3902 3.1006 6.2701 1.3117 1.5158 2.1914 2.4136 1.5226 3.7292 2.2385 2.0694 1.5945 1.3148 1.8863 2.3890 1.4663 2.3051 1.0913 2.3149 1.2863 1.6454 1.2144 1.4827 2.0099 2.0672 1.9856 1.6194 1.8522 1.5845 1.4887 2.4587 2.6202 1.5951 1.2294 1.6799 1.4491 1.2688 1.7424 1.3411 8.1308 1.1950 1.1912 1.1380 2.1508 1.1302 1.1249 1.1158 1.0511 1.0467 1.0473 1.0549 1.0574 1.0559 1.8783 1.0673 1.0875 2.2743 1.0558 6.0056 7.2229 6.7780 9.5799 12.7754 1.0560 1.0571 1.0691 1.0385 1.0362 1.0607 1.0737 1.0742 1.0837 1.0577 1.0904 1.0999 1.0855 1.0961 1.1010 1.0986 1.1007 1.1007 1.1001 1.0861 1.0879 1.0905 1.1097 1.0915 1.0961 1.1016 1.0776
irintensity: 0.0523 0.5007 0.2378 0.4450 0.6099 0.2861 1.2753 2.6645 2.2005 2.2862 0.1919 1.1220 4.4330 6.4309 0.9423 0.5352 0.5267 0.9081 3.4203 1.7344 0.8058 3.4846 1.4395 11.3486 5.8996 0.3931 2.2728 5.2687 1.0655 0.7993 27.2511 19.3233 0.6704 2.9328 0.0069 0.2286 12.8213 5.6498 14.6025 9.8372 2.5404 9.6376 48.9281 11.1776 4.1560 13.8455 0.1522 4.7619 20.6814 20.0054 23.1784 58.9423 16.3317 7.9457 34.9709 6.4911 5.1114 12.0483 1.1441 2.7351 0.2010 10.1233 4.9280 15.5519 37.9635 2.1471 54.8909 18.9299 24.0977 0.0426 4.0006 0.1820 0.1059 18.0223 4.4347 51.5637 16.7326 45.7918 25.7432 32.4215 10.0188 10.9926 27.6499 343.4958 8.2144 35.2260 0.1858 9.4284 12.7010 29.9084 5.2550 16.4966 15.2833 8.7874 11.6225 34.4355 3.8197 11.3472 18.0428 52.7601 220.3016 1.9095 1.4170 19.8585 11.1333 0.1880 30.8016 7.5991 0.0034 18.1404 13.1261 3.5538 8.5087 1.5293 63.1420 7.4933 8.7879 10.6634 8.1754 6.2004 22.4563 34.8835 333.7203 9.8391 11.7676 37.5967 10.0673 1.4153 229.4344 82.9512 116.7256 351.0740 71.6279 157.3940 97.8223 16.7768 21.7320 12.2001 25.8175 53.8689 30.6475 26.7517 4.5001 2.9768 0.8657 13.5967 27.8794 23.7630 46.6635 11.5989 17.1452 5.1973 1.4503 4.3290 14.7742 10.1298 32.3313 17.7897 47.1605
temp: 298.150 k
press: 1.00000 atm
elementType: 16 8 8 8 8 7 7 7 6 6 6 6 6 6 6 6 6 6 6 6 6 6 6 6 6 6 6 6 1 1 1 1 1 1 1 1 1 1 1 1 1 1 1 1 1 1 1 1 1 1 1 1 1 1 1
symmnumber: 1
zpe: 1165070.0 jmol-1
zpe.correction: 0.443752 hartree
zpe.thermalcorrener: 0.473248 hartree
zpe.thermalcorrenthalpy: 0.474192 hartree
zpe.thermalcorrgfe: 0.378060 hartree
zpe.sumelectzpe: -1639.409254 hartree
zpe.sumelectthermal: -1639.379758 hartree
zpe.sumelectthermalent: -1639.378814 hartree
zpe.sumelectthermalfe: -1639.474946 hartree
dipole: -2.9049 -5.5113 0.0206
dipole: 6.2300
quadrupole: -146.1723 -180.4369 -180.6373
quadrupole: -14.3274 -7.2045 -5.8215
quadrupole: 22.9099 -11.3547 -11.5551 -14.3274 -7.2045 -5.8215
hfenergy: -1639.8530057 hartree
pointgroup: C01 [X(C20H27N3O4S1)]
dipole: -1.017957 1.7220902 1.4162899 debye
polarizability: 292.1812575|-8.9077745|254.2270174|-2.4004322|21.1928901|234.4624291 unknown
InChI: InChI=1S/C20H27N3O4S/c1-20(2)16(19(26)27-11-10-22(3)4)23-17(25)15(18(23)28-20)21-14(24)12-13-8-6-5-7-9-13/h5-9,15-16,18,21H,10-12H2,1-4H3
charge 0 multiplicity 1
55 atoms
S  0.604008 -0.015732 1.3848
O  0.256504 0.625136 -2.954693
O  -3.818576 1.365478 0.256782
O  -3.021568 -0.755058 0.833177
O  3.045425 -2.945059 -2.308007
N  -0.805165 -0.175919 -0.910656
N  2.393034 -1.074567 -1.083339
N  -7.389872 0.108299 0.20544
C  0.00204 -1.095611 -0.073955
C  -0.543219 1.489451 0.877315
C  -1.523356 0.903983 -0.236652
C  0.984476 -1.28513 -1.293207
C  0.155814 -0.115883 -1.963328
C  -1.262599 1.988266 2.144722
C  0.338184 2.593701 0.255152
C  -2.840941 0.380487 0.341072
C  3.348512 -1.926922 -1.618805
C  4.822787 -1.566789 -1.330329
C  -5.173931 1.014384 0.795264
C  -5.990027 0.235203 -0.254776
C  5.073136 -0.324637 -0.4926
C  5.131434 0.958679 -1.098972
C  5.230454 -0.416108 0.915149
C  -8.227201 1.274501 -0.139276
C  -8.028454 -1.171907 -0.16015
C  5.342661 2.118582 -0.319875
C  5.443129 0.741486 1.697696
C  5.499588 2.01343 1.082211
H  -0.521218 -1.97177 0.32717
H  -1.746614 1.704142 -0.96264
H  0.859795 -2.248534 -1.818708
H  -0.529247 2.39099 2.864945
H  -1.968244 2.799531 1.885103
H  -1.819324 1.17777 2.644209
H  1.156488 2.869053 0.942325
H  0.789117 2.267826 -0.697526
H  -0.269772 3.498325 0.058079
H  2.68682 -0.286536 -0.497155
H  5.263916 -2.462906 -0.85646
H  5.302945 -1.479685 -2.322716
H  -5.625915 1.991338 1.024814
H  -5.060025 0.414981 1.713473
H  -5.550339 -0.770995 -0.365521
H  -5.906032 0.748362 -1.243046
H  5.014484 1.046642 -2.186161
H  5.189761 -1.399721 1.399109
H  -7.749829 2.208452 0.20609
H  -9.205397 1.192841 0.36729
H  -8.411629 1.37042 -1.239122
H  -7.413182 -2.013626 0.202003
H  -8.179413 -1.297575 -1.261541
H  -9.017908 -1.241215 0.326912
H  5.390011 3.099786 -0.805452
H  5.566147 0.650652 2.782699
H  5.66913 2.911405 1.686766
