program: Gaussian 09
title: 000189751
version: EM64L-G09RevD.01
frameworkgroup: C1[X(C20H24N4O5)]
method: RPBEPBE
basis: SDD
operation: Freq
keyword: #p
keyword: freq=noraman
keyword: PBEPBE/SDD
title: #p freq=noraman PBEPBE/SDD
converged: YES YES NO NO
title: Mulliken charges:
elementType: O O O O O N N N N C C C C C C C C C C C C C C C C C C C C H H H H H H H H H H H H H H H H H H H H H H H H
charge: -0.237430 -0.272536 -0.355547 -0.221297 -0.217500 -0.376357 -0.457361 -0.571424 0.019172 -0.424765 -0.269582 -0.389790 -0.349265 0.194058 -0.400597 0.345754 0.480346 -0.321198 -0.427851 -0.479189 0.470164 -0.362544 -0.343620 0.392111 -0.383067 -0.365681 -0.224284 -0.226292 -0.230098 0.221353 0.227790 0.292775 0.263176 0.153466 0.177862 0.229004 0.174566 0.214163 0.338244 0.370950 0.259389 0.276585 0.313085 0.253600 0.228090 0.244280 0.285160 0.285917 0.234692 0.266688 0.230608 0.231117 0.233113
chargesum: 0.00000
title: Mulliken charges with hydrogens summed into heavy atoms:
elementType: O O O O O N N N N C C C C C C C C C C C C C C C C C C C C
charge: -0.237430 -0.272536 -0.355547 -0.221297 -0.217500 -0.038113 -0.086411 -0.035450 0.019172 0.024378 0.023194 0.026851 0.057601 0.194058 -0.011868 0.345754 0.480346 -0.008113 -0.174251 -0.006819 0.470164 -0.077384 -0.057703 0.392111 -0.148375 -0.098994 0.006324 0.004825 0.003015
polarizability: 3.82117185e+02 -1.93024160e+01 2.91502149e+02 1.51647448e+01 7.21206524e+00 1.80475795e+02
1716.lowfreq: -10.6504 -2.1807 -0.0010 -0.0009 -0.0006 2.1638 13.3388 14.9478 22.0877
frequency: 12.9939 14.4665 21.7901 26.0906 31.2290 37.7106 49.1524 53.8220 65.2461 73.4771 85.5356 88.3841 113.5465 129.8374 135.8588 141.1188 146.2313 165.5876 180.5987 188.7785 221.7486 235.5604 249.0883 274.4829 291.9078 313.6176 335.3837 340.0241 354.6234 375.5621 389.6743 403.3958 417.3101 439.2384 447.5052 500.3736 509.1988 516.7883 539.8446 584.2641 588.1660 593.8094 617.1049 620.3421 636.1495 646.1738 669.4847 681.7333 697.8653 704.8250 732.5935 740.5800 758.4001 763.4873 773.4354 797.7282 816.2525 829.1168 835.9642 847.3054 859.1848 878.9661 884.6883 908.0095 925.9516 936.0046 940.2599 959.4920 979.4644 983.1628 986.5441 990.4461 999.6891 1000.0777 1002.6224 1010.6600 1026.9867 1050.1965 1055.8836 1091.6976 1095.2779 1096.7534 1111.1284 1117.6069 1120.6634 1160.8275 1170.3198 1174.8019 1180.9612 1189.5000 1209.1290 1222.3751 1224.1860 1226.8730 1237.7952 1250.2177 1285.5489 1288.3414 1290.4809 1291.0985 1301.1645 1307.2075 1330.8385 1333.7907 1341.6379 1352.4136 1354.4213 1367.6246 1386.1897 1389.5555 1394.5741 1432.7129 1443.5600 1450.5927 1459.7373 1463.2480 1474.3421 1476.0907 1485.0899 1489.6017 1491.9755 1552.7510 1591.4745 1595.6196 1598.8168 1614.6861 1617.7815 1639.9664 1655.6217 2853.8939 2939.1090 2958.6696 2980.0266 2996.6386 3015.8968 3037.3414 3042.1862 3051.7486 3068.7299 3117.6028 3122.0747 3129.8236 3139.4986 3141.2870 3152.1654 3166.5752 3177.5829 3185.5037 3187.4579 3201.5867 3460.1337 3557.6275 3588.1906
redmass: 5.8751 5.5387 5.7575 5.5055 5.0902 4.9861 3.7987 1.9963 7.5676 5.6186 5.1160 6.1522 4.1978 4.6340 2.9471 6.2760 3.1203 5.6418 5.3047 7.1434 3.4986 1.3631 3.6760 6.7799 5.3180 4.2434 5.2910 3.3477 4.6151 2.8057 7.6183 2.8064 3.0266 3.8620 4.0231 4.1668 6.7071 3.4876 3.6990 1.5236 1.5637 1.9813 6.3516 5.9687 5.1016 6.2199 4.8267 5.6987 6.1019 2.0629 1.3095 3.8381 2.1032 3.2976 2.9589 1.8304 3.5167 5.7654 1.3624 5.0899 1.2540 1.5377 2.6747 1.9213 1.2115 1.4829 2.5329 2.2467 1.9563 1.4418 1.3450 5.2642 3.0050 2.8560 1.3306 1.3224 2.2147 3.0345 2.7667 1.5187 2.9571 2.5394 2.1871 1.5334 1.7884 2.2052 2.3247 1.0543 1.5016 1.1175 1.8030 2.8485 1.4547 4.1802 1.1668 1.5474 1.3871 1.7622 1.1225 1.4832 1.5213 1.1868 1.2580 1.3388 1.4003 1.4181 3.9563 1.5176 8.0940 1.4553 6.2476 4.6372 2.1820 1.0845 1.1513 1.0694 1.1532 1.8390 2.2973 2.6610 1.0908 2.8049 6.9116 6.2328 7.6088 6.0514 5.7513 1.0947 2.2817 1.0719 1.0678 1.0653 1.0775 1.0687 1.0852 1.0899 1.0587 1.0978 1.1010 1.1068 1.0879 1.0872 1.0910 1.0920 1.0965 1.1016 1.0906 1.0943 1.0858 1.0959 1.0448 1.0772 1.0978
irintensity: 0.1698 0.2043 0.3871 0.0375 0.3636 0.0898 0.9330 2.9342 2.7220 1.4365 2.7815 1.2046 4.1468 5.5651 6.1149 3.5155 4.0505 1.7806 0.3218 3.1224 9.7944 52.0573 5.1123 23.3336 9.1232 7.8557 0.2914 3.3589 7.2440 10.8464 18.6275 0.0780 0.0271 20.3534 9.4889 11.8100 0.9220 16.1957 14.6269 112.6504 175.9194 20.0606 0.8397 0.6226 0.0870 6.3321 22.3439 5.2553 32.2470 54.8523 3.8163 3.2637 63.4952 58.7954 3.0947 9.4805 10.2481 7.9941 1.0914 32.8227 0.5166 33.2425 53.1690 1.5079 184.7834 7.1154 7.3594 43.6844 28.5251 1.5340 2.1391 1.6056 33.7869 44.7343 1.1123 0.5365 4.2938 59.8683 19.4045 7.6840 15.1544 12.2151 44.6804 59.0903 7.0631 0.5334 296.8295 0.0476 75.4185 8.8621 389.2722 34.9718 10.6663 379.0183 15.9185 27.7759 56.6365 31.4204 0.9578 18.1868 59.5318 55.9036 2.7290 9.3895 3.1210 18.0472 65.5424 14.2760 0.9617 26.7406 117.4250 25.4841 9.9820 23.9591 16.3223 1.3967 52.9110 484.1698 44.6729 46.6485 5.7621 596.1455 283.1479 97.1133 54.9769 0.5239 93.4320 39.6967 132.4933 113.0512 61.0195 31.0260 9.9014 28.3114 28.8391 17.3481 27.3416 11.3239 56.8904 4.1124 6.3946 0.6683 4.7711 14.5364 28.6829 26.7004 0.6973 21.9759 683.1095 2.9232 1.1654 77.0438 0.3992
temp: 298.150 k
press: 1.00000 atm
elementType: 8 8 8 8 8 7 7 7 7 6 6 6 6 6 6 6 6 6 6 6 6 6 6 6 6 6 6 6 6 1 1 1 1 1 1 1 1 1 1 1 1 1 1 1 1 1 1 1 1 1 1 1 1
symmnumber: 1
zpe: 1106126.3 jmol-1
zpe.correction: 0.421301 hartree
zpe.thermalcorrener: 0.449698 hartree
zpe.thermalcorrenthalpy: 0.450642 hartree
zpe.thermalcorrgfe: 0.356419 hartree
zpe.sumelectzpe: -1369.465968 hartree
zpe.sumelectthermal: -1369.437572 hartree
zpe.sumelectthermalent: -1369.436628 hartree
zpe.sumelectthermalfe: -1369.530851 hartree
dipole: -11.2399 0.9267 0.5698
dipole: 11.2924
quadrupole: -213.5946 -169.6022 -163.4516
quadrupole: 11.8386 -6.8551 9.6042
quadrupole: -31.3784 12.6139 18.7645 11.8386 -6.8551 9.6042
hfenergy: -1369.8872697 hartree
pointgroup: C01 [X(C20H24N4O5)]
dipole: -4.2278305 1.0615852 0.8583158 debye
polarizability: 371.8450113|-35.0026079|288.9293811|-7.1481986|39.9582668|193.3207368 unknown
InChI: InChI=1S/C20H24N4O5/c21-13-5-4-8-18(23-20(26)29-14-15-6-2-1-3-7-15)19(25)22-16-9-11-17(12-10-16)24(27)28/h1-3,6-7,9-12,18,22-23H,4-5,8,13-14,21H2
charge 0 multiplicity 1
53 atoms
O  1.970929 2.228417 -0.174453
O  -2.526899 -0.782551 1.118334
O  -1.258738 -1.020852 -0.857567
O  6.115565 -4.121733 -1.505876
O  7.311703 -2.276657 -0.891948
N  -1.250427 0.955595 0.392391
N  1.329839 0.065773 -0.855395
N  -0.664792 7.369307 2.550348
N  6.197203 -2.875842 -1.162498
C  -0.690163 3.258404 -0.363453
C  -0.441415 1.747262 -0.562509
C  -0.470955 3.800588 1.069807
C  -0.657641 5.33305 1.128276
C  1.080202 1.388161 -0.490561
C  -0.471423 5.906322 2.548529
C  -1.653297 -0.328195 0.138527
C  2.567855 -0.610108 -0.908789
C  3.816602 0.011987 -0.615399
C  2.535468 -1.986546 -1.284207
C  -3.066395 -2.182399 0.93188
C  -4.360428 -2.176117 0.150763
C  5.003211 -0.735796 -0.700394
C  3.718953 -2.731932 -1.369087
C  4.948511 -2.097118 -1.075019
C  -5.604725 -2.094765 0.826092
C  -4.34431 -2.255552 -1.266264
C  -6.815755 -2.088018 0.098989
C  -5.554541 -2.248588 -1.993822
C  -6.792251 -2.165252 -1.313242
H  -1.724582 3.484176 -0.69025
H  -0.005939 3.79562 -1.045527
H  -0.779277 1.459953 -1.579245
H  0.547754 3.536145 1.405683
H  -1.187806 3.338606 1.78471
H  -1.670809 5.598266 0.756181
H  0.067985 5.830493 0.457223
H  -1.151327 5.357392 3.248783
H  0.562836 5.698262 2.883696
H  -1.569603 1.402804 1.253397
H  0.480453 -0.49567 -1.078649
H  -1.60735 7.666327 2.278788
H  -0.341296 7.844275 3.39778
H  3.834749 1.064358 -0.329044
H  1.573484 -2.461997 -1.507069
H  -3.208603 -2.522579 1.969128
H  -2.283679 -2.776161 0.430303
H  5.97326 -0.281535 -0.481948
H  3.714519 -3.786609 -1.655219
H  -5.623751 -2.036503 1.921414
H  -3.381843 -2.311157 -1.78728
H  -7.772593 -2.02755 0.629127
H  -5.534289 -2.311984 -3.087371
H  -7.731074 -2.163775 -1.878365
