program: Gaussian 09
title: 000189745
version: EM64L-G09RevD.01
frameworkgroup: C1[X(C15H19NO7)]
method: RPBEPBE
basis: SDD
operation: Freq
keyword: #p
keyword: freq=noraman
keyword: PBEPBE/SDD
title: #p freq=noraman PBEPBE/SDD
converged: YES YES NO NO
title: Mulliken charges:
elementType: O O O O O O O N C C C C C C C C C C C C C C C H H H H H H H H H H H H H H H H H H H
charge: -0.295979 -0.243688 -0.440060 -0.456772 -0.181312 -0.296442 -0.430784 -0.394903 -0.105107 -0.111264 -0.182043 -0.362070 -0.072347 -0.057645 0.370210 -0.109479 -0.354594 -0.385890 0.313472 -0.410347 -0.342238 0.285769 -0.793240 0.238906 0.245913 0.260571 0.210363 0.246889 0.275881 0.204246 0.320983 0.358106 0.364486 0.190932 0.285202 0.277103 0.227125 0.252834 0.253851 0.270936 0.217934 0.354491
chargesum: 0.00000
title: Mulliken charges with hydrogens summed into heavy atoms:
elementType: O O O O O O O N C C C C C C C C C C C C C C C
charge: -0.295979 -0.243688 -0.081954 -0.092286 -0.181312 -0.296442 -0.076293 -0.073921 0.133799 0.134650 0.078529 0.095182 0.203534 0.146601 0.370210 0.081454 -0.069392 -0.108787 0.313472 -0.183222 -0.089404 0.285769 -0.050519
polarizability: 2.49639461e+02 -2.67522198e+01 1.90962904e+02 9.78259846e+00 9.61278675e+00 1.30911806e+02
1716.lowfreq: -8.7259 -0.0006 -0.0004 0.0005 2.1500 5.6067 19.7418 35.3176 44.9601
frequency: 19.6753 35.2815 44.9440 55.2142 58.1013 75.7429 79.2332 85.3965 97.4978 118.0878 120.8966 138.4261 163.1998 176.2371 210.7028 217.4796 252.3285 256.8097 260.2277 281.8828 310.5845 346.5631 359.4553 368.5007 380.6579 406.8568 412.2042 427.1623 452.8991 473.4446 480.2278 490.2047 517.9259 549.5681 575.9153 583.8055 605.7025 616.4464 632.7994 660.0870 680.9677 704.5626 741.2138 788.1820 817.2945 820.2959 837.8481 868.3626 875.6240 892.2463 914.1584 927.6197 930.4480 949.8619 969.4924 981.5770 987.2638 994.1751 1005.6472 1011.4385 1020.6802 1042.3693 1044.7916 1049.0979 1090.6024 1106.4647 1125.7968 1142.1059 1143.3051 1181.6366 1185.7774 1211.3841 1216.0107 1221.6410 1235.3811 1249.8287 1256.0430 1269.7791 1280.6646 1302.2094 1312.4187 1322.9146 1330.2638 1332.9874 1358.9155 1362.5040 1373.4474 1383.0464 1388.7360 1391.8190 1399.4233 1426.5294 1448.6450 1463.3296 1467.1349 1475.7275 1510.4699 1600.4613 1610.6810 1628.4112 1635.2270 2897.8722 2900.4640 2941.6641 2968.8131 2973.6062 2993.8567 3015.5071 3032.7747 3087.6411 3110.7580 3113.3908 3114.4170 3139.4707 3161.6750 3181.6483 3461.0967 3537.8630 3581.0685 3588.7066
redmass: 5.9876 5.3237 6.2159 3.4864 5.3161 3.2939 2.8689 5.8773 1.7516 4.4289 5.3986 4.7393 8.0202 4.7517 4.2961 4.8059 4.2363 1.2471 5.3800 6.2641 4.7481 4.8866 3.8704 1.1213 3.8934 3.4495 3.0330 3.1148 4.8383 2.7239 4.1800 1.5117 2.8833 5.6245 3.9137 4.6204 4.6114 6.0891 7.0701 2.5490 1.3816 3.5144 3.7457 4.6221 1.5388 2.6738 1.5748 3.4252 2.6162 6.0577 3.5281 4.6587 4.1417 3.3807 1.5291 1.3517 1.6593 3.9469 2.9780 2.0839 3.0399 2.7860 2.3128 2.4900 2.2449 1.4240 2.8270 1.3530 3.7197 1.1356 1.1544 1.3213 1.2177 1.7473 1.4565 2.9331 1.3333 1.3266 1.7211 1.2689 1.3213 1.2155 1.3271 1.2164 1.3272 1.4508 1.4929 1.4797 1.2359 1.4311 5.1897 2.8382 1.1629 1.2716 1.0934 1.4040 2.8347 6.6479 6.3688 6.2127 8.9734 1.0828 1.0871 1.0796 1.0779 1.0735 1.0366 1.0851 1.0857 1.0983 1.0998 1.0887 1.0977 1.0969 1.0885 1.0970 1.0650 1.0776 1.0660 1.0670
irintensity: 1.8526 0.5085 0.2074 0.6736 3.0297 1.2874 9.3381 16.1632 1.4242 8.1395 2.8156 1.4201 7.3003 4.0105 43.0712 26.6722 8.2711 93.5853 11.1850 16.4039 13.6997 4.1976 8.8280 141.2794 4.8373 3.4783 0.4788 18.0415 6.5692 44.6886 27.3330 200.1709 37.4715 22.2393 13.8366 12.9200 17.3463 14.0677 0.5453 20.3425 54.4355 13.3314 11.4352 24.7212 54.6604 3.4274 50.8092 35.3006 11.2489 142.6129 26.2303 2.2732 34.3716 12.6068 9.5897 0.9535 3.6435 228.7067 0.8463 6.1647 33.1830 39.3383 31.5246 45.7237 35.3338 26.7824 1.2519 248.5135 2.3044 35.8835 8.5621 42.9182 38.0993 6.7568 6.8383 26.3196 7.7340 35.7214 87.1802 4.1893 41.0051 11.4311 5.2990 8.4973 8.9131 26.3822 33.9805 0.5084 46.4686 39.9790 25.7402 19.6363 66.2617 78.3382 14.5179 57.2330 58.2041 21.5326 149.4121 74.6903 186.9464 41.6049 101.9755 43.3555 7.9304 49.6428 8.6642 31.9807 10.0499 11.3486 9.3877 17.1347 19.5722 3.9019 2.8503 5.1034 35.7357 32.3953 42.8637 16.8793
temp: 298.150 k
press: 1.00000 atm
elementType: 8 8 8 8 8 8 8 7 6 6 6 6 6 6 6 6 6 6 6 6 6 6 6 1 1 1 1 1 1 1 1 1 1 1 1 1 1 1 1 1 1 1
symmnumber: 1
zpe: 858306.3 jmol-1
zpe.correction: 0.326912 hartree
zpe.thermalcorrener: 0.350036 hartree
zpe.thermalcorrenthalpy: 0.350980 hartree
zpe.thermalcorrgfe: 0.273082 hartree
zpe.sumelectzpe: -1162.536272 hartree
zpe.sumelectthermal: -1162.513147 hartree
zpe.sumelectthermalent: -1162.512203 hartree
zpe.sumelectthermalfe: -1162.590101 hartree
dipole: 1.3510 -2.0050 1.2022
dipole: 2.7001
quadrupole: -152.2962 -121.9185 -138.5580
quadrupole: -10.9490 -4.5606 -3.1687
quadrupole: -14.7053 15.6724 -0.9671 -10.9490 -4.5606 -3.1687
hfenergy: -1162.8631832 hartree
pointgroup: C01 [X(C15H19N1O7)]
dipole: -0.5168427 -0.8201896 -0.4343304 debye
polarizability: 248.8291951|28.0348106|190.0990166|10.3124822|-12.5484592|132.5859595 unknown
InChI: InChI=1S/C15H19NO7/c1-8(18)16-11(6-17)13(21)14-12(20)7-22-15(23-14)9-2-4-10(19)5-3-9/h2-6,11-16,19-21H,7H2,1H3
charge 0 multiplicity 1
42 atoms
O  0.273827 0.654784 -0.025303
O  -0.732772 2.841811 -0.052442
O  2.949417 3.294043 0.20921
O  2.268318 0.031741 -1.778572
O  5.085242 -1.080031 0.408266
O  0.407403 -2.414511 1.649419
O  -5.874818 -0.96368 -0.37358
N  1.724466 -2.16707 -0.248539
C  1.624076 1.194733 0.283375
C  1.733423 2.633534 -0.28281
C  2.599954 0.196393 -0.353937
C  0.56252 3.487222 0.244155
C  2.619989 -1.191217 0.371865
C  -0.787187 1.522902 0.548596
C  -2.122817 0.87122 0.291017
C  4.040112 -1.767266 0.467146
C  -2.385803 -0.392017 0.874984
C  -3.115971 1.494925 -0.501727
C  0.6198 -2.673849 0.424216
C  -3.626985 -1.028378 0.665793
C  -4.359548 0.86824 -0.714718
C  -4.613732 -0.392916 -0.128563
C  -0.32124 -3.531434 -0.408499
H  1.779943 1.240739 1.383264
H  1.703407 2.589157 -1.389832
H  3.629641 0.597259 -0.323146
H  0.677095 3.629603 1.339858
H  0.532798 4.46897 -0.250534
H  2.250073 -1.086149 1.417757
H  -0.559991 1.609432 1.638745
H  1.813501 -2.289223 -1.260131
H  3.712435 3.075513 -0.380956
H  1.272546 0.065442 -1.829703
H  4.06883 -2.876431 0.610297
H  -1.618889 -0.888864 1.481385
H  -2.9079 2.474101 -0.941079
H  -3.826008 -2.004867 1.126902
H  -5.139995 1.337708 -1.320394
H  -0.601639 -4.428951 0.166603
H  -1.244866 -2.955832 -0.602156
H  0.111031 -3.841862 -1.375109
H  -5.966283 -1.830323 0.094984
