program: Gaussian 09
title: 000017471
version: EM64L-G09RevD.01
frameworkgroup: C1[X(C16H14O3)]
method: RPBEPBE
basis: SDD
operation: Freq
keyword: #pfreq=noraman
keyword: PBEPBE/SDD
title: #p freq=noraman PBEPBE/SDD
converged: YES YES NO NO
title: Mulliken charges:
elementType: O O O C C C C C C C C C C C C C C C C H H H H H H H H H H H H H H
charge: -0.294089 -0.227155 -0.227244 0.345399 0.345255 0.304753 0.304778 -0.397614 -0.397608 -0.360856 -0.360744 -0.316768 -0.316770 -0.337745 -0.337865 0.124775 0.124675 -0.790251 -0.790269 0.261750 0.261684 0.273579 0.273483 0.247315 0.247279 0.282054 0.281991 0.238113 0.237259 0.262773 0.238085 0.237237 0.262741
chargesum: 0.00000
title: Mulliken charges with hydrogens summed into heavy atoms:
elementType: O O O C C C C C C C C C C C C C C C C
charge: -0.294089 -0.227155 -0.227244 0.345399 0.345255 0.304753 0.304778 -0.135864 -0.135923 -0.087277 -0.087261 -0.069453 -0.069491 -0.055691 -0.055874 0.124775 0.124675 -0.052106 -0.052207
polarizability: 3.36034900e+02 -5.21752383e-02 1.65038609e+02 -1.23475114e+01 -6.27154518e-02 1.07862945e+02
1716.lowfreq: -10.9755 -4.5900 -3.5411 -0.0008 -0.0006 -0.0004 20.4636 32.2527 41.8663
frequency: 20.2009 32.2517 41.8597 68.0963 74.5850 102.4143 114.4551 148.4378 148.9416 177.6403 178.3784 244.1393 270.4291 283.4061 328.8761 375.5329 394.3584 409.5423 414.6260 455.2210 472.1531 482.3302 500.8081 564.3913 567.0819 588.7320 594.7698 621.5908 624.4315 664.4431 701.3834 727.6910 737.7558 778.8052 831.0158 836.5505 841.4278 860.2692 863.4785 946.6128 948.2871 962.2706 962.8244 989.9886 996.4650 1001.7578 1002.6701 1027.0148 1027.2265 1071.0363 1071.9327 1113.7011 1116.2476 1152.9602 1169.9133 1190.6028 1226.8520 1272.7110 1277.1174 1294.8654 1301.1667 1363.3984 1369.5786 1373.6274 1383.6462 1418.0502 1420.6363 1448.5267 1448.8933 1463.8321 1463.8406 1487.0352 1490.1602 1563.4545 1575.9112 1589.2810 1597.3455 1613.2244 1624.6401 2986.0774 2986.0902 3070.0582 3070.0881 3126.8453 3126.8925 3150.0540 3150.7677 3150.9429 3151.5228 3168.0364 3170.1714 3175.5635 3175.9751
redmass: 4.0980 4.3973 7.2967 4.1360 3.5969 6.7094 6.3944 1.0371 1.0347 4.2181 5.3498 7.2890 5.0846 5.3998 4.9969 6.9631 3.5965 2.9060 2.9749 3.9572 3.3386 3.2171 5.6613 4.9583 4.3310 2.4118 2.5752 5.7761 6.8990 5.0332 5.1109 3.6488 3.8457 5.5646 1.2862 1.3551 1.6339 4.5513 1.4556 2.1849 2.1615 1.3468 1.3495 1.3562 1.3490 2.8757 2.9436 1.8240 1.8151 2.5437 2.4028 1.3066 1.2954 1.9476 1.2352 1.5181 3.6418 3.6589 3.5708 1.2962 1.3267 2.5847 1.3267 1.6751 4.7701 4.2910 4.2029 1.1023 1.0944 1.0500 1.0499 2.5185 2.6136 7.0543 7.1284 6.7626 7.3393 7.2646 6.9738 1.0377 1.0377 1.0969 1.0969 1.0989 1.0989 1.0882 1.0883 1.0883 1.0882 1.0967 1.0961 1.0967 1.0969
irintensity: 0.9398 0.7463 1.7611 7.2839 0.3284 1.0755 0.1961 0.6012 0.4380 0.4134 18.5800 0.1619 7.5272 0.1781 4.3893 0.6479 2.5002 2.0148 0.2205 0.3007 4.4871 26.2477 4.2996 60.2741 2.4187 23.2185 5.0595 0.0174 0.5290 0.0097 3.4164 7.9418 0.0462 0.1937 21.6852 10.1177 83.9696 64.0540 24.5399 115.3892 0.3412 0.0708 0.0277 2.8588 0.5755 24.6040 0.1114 2.2711 0.4328 1.1145 2.2283 9.0643 17.5765 6.5748 317.0143 1.1295 610.7051 670.7502 25.7491 43.1280 0.0417 6.0036 21.9459 152.1435 0.1396 16.2577 1.5360 43.2499 27.7884 25.7974 15.6842 129.3711 1.5145 166.9910 67.2332 313.4209 155.7907 126.1428 5.4339 3.2406 3.6575 11.9719 12.9998 31.2366 6.0228 1.4369 14.3477 5.3060 0.0235 14.4675 0.7983 2.0585 5.9066
temp: 298.150 k
press: 1.00000 atm
elementType: 8 8 8 6 6 6 6 6 6 6 6 6 6 6 6 6 6 6 6 1 1 1 1 1 1 1 1 1 1 1 1 1 1
symmnumber: 1
zpe: 667641.2 jmol-1
zpe.correction: 0.254291 hartree
zpe.thermalcorrener: 0.271792 hartree
zpe.thermalcorrenthalpy: 0.272737 hartree
zpe.thermalcorrgfe: 0.206804 hartree
zpe.sumelectzpe: -842.431101 hartree
zpe.sumelectthermal: -842.413600 hartree
zpe.sumelectthermalent: -842.412656 hartree
zpe.sumelectthermalfe: -842.478588 hartree
dipole: 0.0092 4.8030 -0.0087
dipole: 4.8030
quadrupole: -112.0496 -118.7097 -110.9144
quadrupole: -0.0424 -19.3968 -0.0223
quadrupole: 1.8416 -4.8185 2.9769 -0.0424 -19.3968 -0.0223
hfenergy: -842.6853923 hartree
pointgroup: C01 [X(C16H14O3)]
dipole: -0.0035261 1.8896321 0.0015324 debye
polarizability: 335.1826037|0.0339861|165.0386758|-18.6066236|0.0015463|108.7151742 unknown
InChI: InChI=1S/C16H14O3/c1-11(17)13-3-7-15(8-4-13)19-16-9-5-14(6-10-16)12(2)18/h3-10H,1-2H3
charge 0 multiplicity 1
33 atoms
O  -0.000523 1.532015 -0.005388
O  -5.348933 -2.048606 -0.59236
O  5.344934 -2.050687 0.594386
C  -1.237806 0.847734 0.018391
C  1.23609 0.847528 -0.024951
C  -3.825242 -0.289659 0.022169
C  3.82356 -0.29052 -0.022345
C  -2.293633 1.520832 0.672382
C  2.294358 1.521349 -0.674322
C  -1.456578 -0.383184 -0.64917
C  1.452533 -0.3848 0.640801
C  -3.580389 0.950574 0.671825
C  3.580917 0.950914 -0.670618
C  -2.746528 -0.93991 -0.63907
C  2.742403 -0.941658 0.634006
C  -5.178686 -0.93849 -0.006004
C  5.176688 -0.939627 0.009198
C  -6.345985 -0.240517 0.684872
C  6.346305 -0.24072 -0.676864
H  -2.086984 2.474147 1.16672
H  2.089501 2.475534 -1.167764
H  -0.639279 -0.881771 -1.178495
H  0.633448 -0.884521 1.166285
H  -4.391994 1.476412 1.184583
H  4.394236 1.477573 -1.179825
H  -2.953938 -1.886724 -1.148447
H  2.947783 -1.889502 1.142302
H  -6.529435 0.75837 0.246887
H  -6.14498 -0.098825 1.763196
H  -7.250746 -0.855176 0.567102
H  6.528516 0.757414 -0.236644
H  6.148679 -0.097193 -1.755566
H  7.250606 -0.855706 -0.55727
