program: Gaussian 09
title: 000189731
version: EM64L-G09RevD.01
frameworkgroup: C1[X(C12H14N2O9)]
method: RPBEPBE
basis: SDD
operation: Freq
keyword: #p
keyword: freq=noraman
keyword: PBEPBE/SDD
title: #p freq=noraman PBEPBE/SDD
converged: YES YES NO NO
title: Mulliken charges:
elementType: O O O O O O O O O N N C C C C C C C C C C C C H H H H H H H H H H H H H H
charge: -0.215612 -0.302483 -0.459807 -0.449104 -0.430151 -0.391366 -0.219817 -0.215155 -0.222032 -0.684842 0.013774 -0.161766 -0.174725 -0.129850 -0.204201 -0.115299 0.195765 0.242834 0.331380 -0.239136 -0.544622 -0.427444 0.436568 0.235117 0.264822 0.299572 0.288387 0.292663 0.369389 0.371471 0.339931 0.287820 0.389836 0.282930 0.284153 0.316568 0.344430
chargesum: 0.00000
title: Mulliken charges with hydrogens summed into heavy atoms:
elementType: O O O O O O O O O N N C C C C C C C C C C C C
charge: -0.215612 -0.302483 -0.090418 -0.077633 -0.090219 -0.001529 -0.219817 -0.215155 -0.222032 -0.023844 0.013774 0.073351 0.124847 0.134972 0.084186 0.177364 0.195765 0.242834 0.331380 0.048683 -0.261692 -0.143291 0.436568
polarizability: 2.72230437e+02 1.18144237e+01 1.33179731e+02 3.04789680e+00 2.70549434e+01 1.58872695e+02
1716.lowfreq: -12.5724 -7.0814 -3.7693 -0.0006 0.0006 0.0007 15.9002 20.5994 30.5230
frequency: 15.4476 20.4131 30.3820 57.2718 61.4990 65.7870 79.6062 97.8597 138.0474 156.1811 173.3999 186.3726 205.0603 219.4538 228.3230 249.2445 289.7524 310.4891 336.6092 345.6202 351.3090 379.7548 386.7996 399.6268 412.4692 422.6082 425.5448 444.9587 449.8216 487.5749 498.6914 520.4151 529.1707 539.8179 559.5517 569.2948 571.2404 600.3471 633.0017 639.0471 669.4966 699.6070 719.8033 736.3055 751.0404 767.9414 820.1392 863.5801 892.3366 893.2794 908.7336 926.4815 936.9899 950.3410 961.7345 1012.6475 1029.8439 1036.7063 1037.9887 1055.6652 1061.1544 1080.7131 1087.2990 1113.7112 1136.7773 1180.6065 1186.7129 1216.5688 1218.0054 1230.7861 1247.1853 1260.1193 1278.0738 1280.0922 1288.6400 1302.8757 1313.8870 1319.2133 1341.8805 1347.5923 1364.2617 1388.0556 1389.6384 1404.0388 1426.7878 1451.0254 1510.1479 1589.8918 1611.9454 1638.7740 1649.5547 2953.5385 2990.9446 3063.4349 3067.9258 3080.2484 3172.3482 3173.7989 3197.9988 3515.1565 3530.1358 3541.0328 3562.9252 3571.9091 3708.2571
redmass: 6.1900 8.2212 7.2392 9.9386 11.0365 7.5279 8.4942 7.5061 8.2895 7.2759 6.2249 6.4094 5.0027 5.8053 4.6405 4.6487 5.0563 4.9787 5.7631 1.2156 4.7776 6.8804 6.2525 2.6200 1.2764 2.4288 2.1901 1.2523 2.6415 3.6767 1.2500 4.2939 5.4317 5.7835 5.1475 1.9704 3.6863 2.8979 5.2532 6.3821 3.0941 5.5163 5.0654 3.8634 10.5530 5.3148 1.4707 5.8774 6.4731 1.5796 7.0798 4.3546 4.8667 1.3954 5.2407 3.3656 3.3149 2.3593 2.6542 3.1151 2.5627 2.8530 1.7054 3.1958 1.5609 1.4005 2.7720 1.6997 3.1498 1.1975 1.2771 1.2075 1.3169 1.4375 1.4455 2.2965 1.3074 1.2589 1.6849 1.4383 12.8512 1.6230 1.2024 1.5276 5.3020 4.6838 3.8664 6.6185 1.7513 2.5362 8.8712 1.0827 1.0844 1.0864 1.0862 1.0858 1.0918 1.0903 1.0958 1.0643 1.0660 1.0653 1.0448 1.0660 1.1045
irintensity: 0.1832 1.3498 0.7022 1.7670 0.2423 1.5187 1.2275 4.1777 5.1340 1.8548 0.6503 4.6475 4.3269 2.3308 9.5561 7.1970 11.3217 5.9517 37.4038 76.3124 10.5952 3.3645 2.5944 35.8090 135.4548 57.9404 93.8223 172.0350 1.4862 43.7027 123.2104 24.0020 1.5107 0.3672 0.7879 35.7900 5.6867 34.2864 69.3833 29.2412 114.3838 21.4499 21.7131 6.1842 24.7434 10.4016 20.0979 128.3014 50.8692 42.5127 312.3547 97.5472 220.1784 8.3847 104.8005 29.4815 12.7876 45.8729 41.1052 69.9616 93.1279 57.0375 40.1496 20.3131 113.1156 117.1630 232.6974 47.7670 308.7194 28.9096 17.3470 23.1587 44.4704 6.2927 28.1776 85.0904 40.9446 6.0576 14.9777 4.1327 112.0085 5.9178 19.4306 22.3240 7.4080 19.1186 203.3780 58.3817 12.4944 179.4797 233.7815 25.7565 25.3301 10.4309 2.2117 1.2880 3.6672 1.7114 3.2695 28.7055 11.4004 33.4521 82.5512 25.7696 42.7414
temp: 298.150 k
press: 1.00000 atm
elementType: 8 8 8 8 8 8 8 8 8 7 7 6 6 6 6 6 6 6 6 6 6 6 6 1 1 1 1 1 1 1 1 1 1 1 1 1 1
symmnumber: 1
zpe: 704625.6 jmol-1
zpe.correction: 0.268378 hartree
zpe.thermalcorrener: 0.290418 hartree
zpe.thermalcorrenthalpy: 0.291362 hartree
zpe.thermalcorrgfe: 0.215328 hartree
zpe.sumelectzpe: -1250.354082 hartree
zpe.sumelectthermal: -1250.332042 hartree
zpe.sumelectthermalent: -1250.331098 hartree
zpe.sumelectthermalfe: -1250.407132 hartree
dipole: 7.1608 0.1251 0.7888
dipole: 7.2052
quadrupole: -171.6880 -131.4678 -124.1646
quadrupole: -3.6137 -21.1552 4.7876
quadrupole: -29.2479 10.9723 18.2756 -3.6137 -21.1552 4.7876
hfenergy: -1250.6224601 hartree
pointgroup: C01 [X(C12H14N2O9)]
dipole: 2.813751 0.1550777 0.3073185 debye
polarizability: 269.7411608|21.8063283|120.855064|6.1637406|12.0033609|173.6866384 unknown
InChI: InChI=1S/C12H14N2O9/c13-5-3-4(14(20)21)1-2-6(5)22-12-9(17)7(15)8(16)10(23-12)11(18)19/h1-3,7-10,12,15-18H,13H2
charge 0 multiplicity 1
37 atoms
O  1.625769 -0.138893 -1.346421
O  0.284237 0.544623 0.550285
O  4.810059 1.882156 0.290708
O  2.257137 3.021327 0.281056
O  5.045749 -0.726113 -1.315852
O  0.972068 -2.619089 0.091032
O  2.434253 -1.71342 1.656944
O  -5.551159 -0.647153 -1.816035
O  -5.99436 -0.408965 0.408462
N  -1.494879 0.560794 2.544582
N  -5.179171 -0.426441 -0.597147
C  3.746683 1.183066 -0.431514
C  3.947582 -0.344699 -0.414096
C  2.442497 1.574798 0.281316
C  2.614679 -1.071728 -0.744966
C  1.241299 0.970446 -0.468783
C  2.02265 -1.799773 0.480128
C  -1.05399 0.290245 0.166995
C  -1.973602 0.308532 1.268654
C  -1.475334 0.024797 -1.149369
C  -3.340879 0.067043 0.9934
C  -2.83946 -0.207973 -1.418412
C  -3.745207 -0.180258 -0.336461
H  3.705112 1.533991 -1.486881
H  2.478434 1.177359 1.317028
H  4.303519 -0.651031 0.58337
H  2.776688 -1.823832 -1.535274
H  0.778379 1.711046 -1.143284
H  5.6876 1.584235 -0.059181
H  3.097711 3.422294 0.62589
H  4.811114 -0.466223 -2.245166
H  -0.738324 -0.040363 -1.953414
H  0.561156 -3.05415 0.886986
H  -4.093661 0.078003 1.786435
H  -3.201344 -0.41953 -2.426307
H  -2.125269 0.613096 3.338578
H  -0.507633 0.767186 2.673214
