program: Gaussian 09
title: 000189726
version: EM64L-G09RevD.01
frameworkgroup: C1[X(C19H22O4)]
method: RPBEPBE
basis: SDD
operation: Freq
keyword: #pfreq=noraman
keyword: PBEPBE/SDD
title: #p freq=noraman PBEPBE/SDD
converged: NO YES NO NO
title: Mulliken charges:
elementType: O O O O C C C C C C C C C C C C C C C C C C C H H H H H H H H H H H H H H H H H H H H H H
charge: -0.188841 -0.200722 -0.436522 -0.250700 0.212019 -0.105262 0.191543 -0.473372 -0.625998 0.408685 -0.567296 0.136883 -0.785799 -0.762505 -0.753191 0.147717 -0.029467 -0.608162 -0.499898 0.351816 0.119690 -0.792162 0.092120 0.215179 0.234819 0.208617 0.267421 0.253413 0.252457 0.230760 0.239458 0.234623 0.221638 0.242441 0.217867 0.240521 0.208395 0.254105 0.219296 0.242100 0.325390 0.253868 0.216641 0.253223 0.387190
chargesum: 0.00000
title: Mulliken charges with hydrogens summed into heavy atoms:
elementType: O O O O C C C C C C C C C C C C C C C C C C C
charge: -0.188841 -0.200722 -0.049332 -0.250700 0.212019 0.109917 0.191543 -0.029937 -0.105164 0.408685 -0.084079 0.136883 -0.090079 -0.061676 -0.071395 0.147717 -0.029467 -0.366061 -0.174508 0.351816 0.119690 -0.068431 0.092120
polarizability: 2.94804523e+02 9.67129793e+00 2.22906269e+02 5.35294733e+00 -8.18825151e-01 1.39826796e+02
1716.lowfreq: -3.0505 -0.0007 -0.0003 0.0007 8.6402 16.1610 33.2915 35.5965 43.1640
frequency: 32.5723 35.4166 43.1047 51.5462 87.5733 111.0631 130.2977 148.3297 164.8729 176.8205 197.6798 205.5564 209.5524 234.4615 244.4361 256.7189 278.0191 280.3596 288.0622 295.2204 313.8576 323.9931 340.2126 357.4766 375.1203 405.9075 417.5987 426.4435 446.0814 480.1994 487.1320 505.1145 543.8679 570.4554 571.9433 592.2200 614.5542 626.4466 642.7902 661.7116 692.0027 708.7855 715.5466 741.3943 747.0200 773.4600 797.4307 838.2427 871.9320 893.6129 916.4550 930.2899 938.6092 955.3432 956.6757 979.3975 986.1857 1005.7641 1016.3147 1019.0805 1028.3413 1042.5418 1057.4392 1075.3348 1094.4290 1119.0122 1130.1694 1136.7448 1145.9127 1175.6844 1191.6162 1193.0224 1210.7188 1224.6318 1237.0912 1257.4617 1274.8145 1280.2542 1294.7353 1311.1247 1316.0216 1337.9542 1346.0772 1353.2752 1373.9686 1378.5873 1386.2373 1392.9136 1401.1380 1405.9094 1440.5392 1451.0038 1452.1709 1462.5747 1465.1607 1467.7859 1469.9626 1479.6775 1481.6425 1484.9678 1492.6693 1495.5599 1546.4122 1578.4546 1618.3967 1620.1780 1636.9105 2944.4465 2980.6597 2985.5092 2989.3084 2990.3603 2991.8199 2992.6610 2994.7596 3041.3610 3067.8748 3070.5455 3075.7692 3078.4725 3080.9955 3085.1474 3093.8390 3094.2872 3102.6604 3102.7271 3147.2417 3174.8766 3531.6827
redmass: 5.9585 6.2186 7.8579 4.8974 4.1508 3.2532 3.6201 1.8533 1.8649 1.1068 2.1602 2.3271 2.9128 1.9309 1.9008 1.7899 2.9556 2.7757 3.1872 3.1021 3.4940 2.8071 3.8286 4.0998 4.5006 4.9385 3.2792 3.4793 2.9780 2.9672 3.0522 3.4393 3.6698 2.4690 1.8552 3.4591 4.1186 2.8763 3.8113 4.0182 3.8787 4.1674 3.3026 4.3393 5.5711 3.5391 2.4858 2.2347 2.6376 1.4877 2.0615 1.9545 1.5084 1.8297 2.6524 2.1492 1.5184 1.9071 1.5859 1.9922 2.1225 1.6052 2.1718 2.4097 2.6623 2.9563 2.0990 2.2276 1.8182 1.7115 2.4619 1.8467 1.7928 4.1753 2.5787 2.2286 2.2502 1.3972 1.5081 1.4478 2.6856 1.3552 1.4739 1.3600 4.6512 1.2152 4.2809 1.3237 1.1978 1.2560 1.0822 1.0810 1.0454 1.0470 1.1996 1.1122 1.0553 1.0584 1.0740 2.3987 1.0922 1.0629 8.8225 9.0782 9.0995 8.2431 8.1705 1.0823 1.0604 1.0630 1.0602 1.0358 1.0370 1.0366 1.0410 1.1016 1.0938 1.0965 1.0953 1.0990 1.0988 1.0993 1.0997 1.1015 1.0976 1.0981 1.0896 1.0914 1.0642
irintensity: 0.5492 0.3899 5.4313 1.0107 1.8714 1.4329 0.8776 0.0861 0.5780 1.0730 1.3979 0.3757 0.1313 1.2689 0.4313 0.2425 0.3918 1.1228 1.1608 2.2099 3.0083 2.0343 1.2409 3.7033 2.4733 5.4267 1.4070 7.6462 9.5445 3.0278 7.8964 17.3648 7.5747 36.6852 49.7609 19.4899 22.2966 30.3666 39.1815 14.1135 2.8557 3.5731 5.1285 1.2747 13.1573 2.3231 1.6614 4.6767 11.1006 9.4049 1.7630 13.6856 3.9633 4.0399 3.8700 57.1855 11.0241 102.5209 13.5257 1.3163 129.4248 9.9812 4.9082 22.2247 17.6934 81.4412 65.0626 20.2170 11.9838 6.9258 16.2401 35.9157 6.5278 25.8257 14.6826 29.7149 123.8295 2.6181 2.2056 5.6259 59.5350 2.3803 4.1066 3.8663 15.9630 15.0582 49.3686 27.1526 21.7026 42.4929 4.7093 27.2176 11.8930 0.6749 17.0193 7.5034 21.7002 2.2185 18.0886 8.1669 0.6095 19.2410 29.1472 188.9763 204.1305 45.4614 392.7765 17.5822 27.8288 9.9001 3.5937 6.7563 30.4457 13.3731 36.3600 24.7987 11.6864 16.9043 6.1443 32.7363 14.2075 29.2976 30.3733 24.1140 10.9687 38.8365 12.4339 5.8490 53.8308
temp: 298.150 k
press: 1.00000 atm
elementType: 8 8 8 8 6 6 6 6 6 6 6 6 6 6 6 6 6 6 6 6 6 6 6 1 1 1 1 1 1 1 1 1 1 1 1 1 1 1 1 1 1 1 1 1 1
symmnumber: 1
zpe: 963547.5 jmol-1
zpe.correction: 0.366996 hartree
zpe.thermalcorrener: 0.388979 hartree
zpe.thermalcorrenthalpy: 0.389923 hartree
zpe.thermalcorrgfe: 0.316803 hartree
zpe.sumelectzpe: -1036.444207 hartree
zpe.sumelectthermal: -1036.422224 hartree
zpe.sumelectthermalent: -1036.421279 hartree
zpe.sumelectthermalfe: -1036.494399 hartree
dipole: 0.2980 -2.3296 2.3546
dipole: 3.3256
quadrupole: -150.7964 -142.8240 -137.1434
quadrupole: 3.4604 11.8137 -4.7582
quadrupole: -7.2085 0.7639 6.4445 3.4604 11.8137 -4.7582
hfenergy: -1036.8112024 hartree
pointgroup: C01 [X(C19H22O4)]
dipole: 0.113473 0.8276921 -1.0069534 debye
polarizability: 294.091268|-11.7807451|222.5532031|-7.8460283|-7.8420866|140.8931165 unknown
InChI: InChI=1S/C19H22O4/c1-10-7-13-12(8-11(10)17(22)23)14(20)9-15-18(2,3)16(21)5-6-19(13,15)4/h7-8,15,22H,5-6,9H2,1-4H3
charge 0 multiplicity 1
45 atoms
O  4.86119 1.278631 1.252052
O  -0.688649 -3.244102 0.139759
O  -5.021696 -1.373246 0.692855
O  -5.569443 0.867483 0.509362
C  1.089423 0.575866 -0.589838
C  1.855149 -0.539755 0.222484
C  3.433798 -0.472417 0.269672
C  1.63608 1.966699 -0.152034
C  1.343642 -1.944308 -0.167899
C  -0.413471 0.434228 -0.250972
C  3.172285 2.07759 -0.29558
C  3.900891 0.992108 0.488299
C  1.187501 0.445349 -2.144621
C  4.141899 -0.963693 -1.035512
C  3.954087 -1.343195 1.445307
C  -0.990071 -0.851561 -0.011072
C  -0.165039 -2.099728 -0.000639
C  -1.279577 1.552803 -0.244821
C  -2.378607 -0.968131 0.223728
C  -2.674438 1.461679 -0.01204
C  -3.229459 0.159052 0.226783
C  -3.501445 2.73056 -0.028152
C  -4.685205 -0.025604 0.478651
H  1.543899 -0.368035 1.277606
H  1.355821 2.155083 0.903395
H  1.17554 2.770141 -0.756858
H  1.819315 -2.739647 0.431218
H  1.584615 -2.17104 -1.225713
H  3.531862 3.05827 0.060723
H  3.457713 1.996105 -1.363956
H  0.858068 -0.545647 -2.50083
H  0.529311 1.197071 -2.616983
H  2.211012 0.617986 -2.515359
H  3.876894 -2.015467 -1.242989
H  3.888251 -0.366462 -1.926332
H  5.237066 -0.918998 -0.896003
H  3.830471 -2.419193 1.232387
H  5.024632 -1.141119 1.614414
H  3.423097 -1.109106 2.385821
H  -0.86982 2.551322 -0.425694
H  -2.790094 -1.965119 0.403659
H  -4.030461 2.881027 0.92923
H  -2.862378 3.607392 -0.227312
H  -4.296987 2.684276 -0.79252
H  -6.001576 -1.431647 0.853022
