program: Gaussian 09
title: 000001129
version: EM64L-G09RevD.01
frameworkgroup: C1[X(C19H23N7O6)]
method: RPBEPBE
basis: SDD
operation: Freq
keyword: #p
keyword: freq=noraman
keyword: PBEPBE/SDD
title: #p freq=noraman PBEPBE/SDD
converged: YES YES NO NO
title: Mulliken charges:
elementType: O O O O O O N N N N N N N C C C C C C C C C C C C C C C C C C C H H H H H H H H H H H H H H H H H H H H H H H
charge: -0.280221 -0.295016 -0.399367 -0.243390 -0.420225 -0.225269 -0.432537 -0.379122 -0.400945 -0.425115 -0.030421 -0.459922 -0.624410 -0.177010 -0.468681 -0.361852 0.108021 0.271710 0.461771 -0.027472 0.139389 -0.132230 -0.391684 -0.388029 -0.434296 0.285106 -0.352324 -0.344409 -0.485005 0.150131 0.111090 0.180150 0.251697 0.258481 0.222958 0.218017 0.196500 0.324777 0.295611 0.324172 0.311275 0.310213 0.249042 0.285106 0.226814 0.230671 0.339528 0.201708 0.273915 0.271587 0.254832 0.307738 0.352245 0.387893 0.376804
chargesum: 0.00000
title: Mulliken charges with hydrogens summed into heavy atoms:
elementType: O O O O O O N N N N N N N C C C C C C C C C C C C C C C C C C C
charge: -0.280221 -0.295016 -0.011474 -0.243390 -0.043421 -0.225269 -0.107761 -0.083511 -0.076773 -0.113839 -0.030421 -0.120395 0.035573 0.074687 0.012758 0.052665 0.108021 0.271710 0.461771 -0.027472 0.139389 0.177983 0.142463 -0.161215 -0.203625 0.285106 -0.150617 -0.070494 0.041415 0.150131 0.111090 0.180150
polarizability: 3.91156475e+02 2.28015997e+01 2.33123050e+02 -7.85544071e+00 1.28015255e+00 2.69446287e+02
1716.lowfreq: -3.4259 -0.6402 -0.0009 -0.0005 0.0007 5.3871 9.7626 11.6517 17.8618
frequency: 9.3211 10.6761 17.8048 19.3723 29.0935 36.2586 42.8960 52.7818 56.3238 61.8746 77.6213 90.7079 93.2083 103.5764 130.4535 145.2338 169.2424 173.1243 189.0623 196.2238 198.7540 221.8778 236.9831 259.9300 272.1865 286.0364 292.5848 324.1314 324.8013 338.0640 356.2238 405.5992 408.8832 422.7039 428.9547 454.3961 460.3424 470.6644 476.7480 502.9073 503.8066 505.8830 509.2525 516.0338 531.4586 538.4623 544.7637 558.6456 585.7641 587.0878 589.6687 594.0053 622.3808 632.7879 634.9809 637.8355 649.9130 656.8352 683.5580 685.8901 703.6090 724.9627 746.5785 755.1679 770.6904 792.8648 801.0244 803.7253 825.9020 845.4415 870.7983 876.6897 898.2543 911.1639 929.2642 935.4661 944.1543 971.8990 990.3912 996.2007 1022.8619 1024.5867 1043.5823 1047.8531 1058.2731 1059.3756 1095.7366 1099.0873 1116.4094 1133.2788 1144.0737 1155.8592 1156.9085 1183.9189 1197.4283 1211.8363 1221.1126 1237.5403 1240.8261 1241.6657 1249.8129 1264.9405 1275.7682 1278.0111 1282.7880 1288.0513 1297.8273 1319.1699 1334.4133 1339.6797 1353.5637 1354.8633 1362.2165 1372.3201 1378.9044 1384.2102 1428.1706 1435.4341 1440.2478 1441.2248 1457.7634 1464.2313 1470.0742 1477.8720 1484.7007 1497.6601 1529.7763 1551.0055 1556.8845 1578.7324 1587.2609 1625.9951 1632.8623 1644.8777 1671.0778 1681.9859 2891.7997 2989.9551 2993.1236 2995.6714 3014.1266 3028.3065 3035.9126 3041.6928 3088.3646 3102.0715 3116.6524 3124.5361 3154.4085 3161.4062 3467.8425 3477.6686 3508.9403 3513.2656 3518.9349 3525.6674 3535.3895 3548.8897 3699.5659
redmass: 7.0378 7.1896 12.1394 6.9461 6.1102 7.2439 4.5015 11.0596 6.4042 6.9591 4.8364 2.9214 5.1194 5.6021 5.1806 5.7597 3.3017 5.0172 4.8243 5.9464 5.1125 6.1319 4.8328 1.3269 2.5450 4.2993 5.1568 4.8655 3.1796 3.1134 5.1540 5.8398 2.8494 4.8672 5.2282 3.0638 3.6792 3.1804 3.1602 1.2947 1.8107 2.5661 2.6975 2.5185 1.2060 3.0915 1.9741 2.5755 1.4449 4.2414 3.2884 4.0160 1.7666 5.5555 1.6574 1.3980 3.2325 2.8917 3.6794 7.2391 4.0532 4.6337 11.2642 3.8253 2.0184 3.3077 2.5132 1.6719 3.7718 1.6631 3.3581 3.9870 4.4533 2.2199 1.4872 2.6087 2.3374 3.1962 1.3546 2.8976 2.1166 2.7463 2.7062 2.4644 2.4395 2.1992 2.7569 2.2744 1.9275 3.4430 2.2540 2.0214 2.4496 1.5164 1.2517 1.3441 1.4467 2.1319 1.4432 1.4883 1.2647 1.6516 2.6756 1.5629 1.5476 1.3894 1.8659 1.4260 1.5100 1.3456 2.1674 1.3974 1.7437 3.3970 1.7804 1.8386 1.9622 2.9772 1.2184 1.9493 1.8673 1.2143 1.1202 1.6736 1.3065 3.4354 3.7919 5.1880 7.9272 1.9715 6.2750 1.9184 5.1969 8.3916 8.2063 7.5906 1.0682 1.0615 1.0888 1.0813 1.0691 1.0805 1.0630 1.0953 1.1047 1.1037 1.0879 1.0893 1.0937 1.0952 1.0760 1.0758 1.0772 1.0639 1.0643 1.0769 1.0763 1.0465 1.1046
irintensity: 0.4365 0.7963 0.6352 0.3640 3.2470 0.9429 2.4829 0.1426 3.1574 2.8923 3.0291 1.4382 3.2607 0.6670 0.5769 4.8148 7.2934 4.4863 16.1715 4.3348 1.9394 13.7505 2.2631 54.6527 55.8084 11.1043 1.6270 0.1719 28.1355 9.3928 14.3444 5.2087 0.7046 44.8916 9.2286 153.8693 4.1561 92.1434 3.7219 212.3218 15.2502 35.0305 200.6803 67.2475 38.2701 200.6004 106.0609 126.3130 11.4162 36.3674 8.2335 2.0170 37.9726 9.7999 116.5555 126.8259 19.2393 4.4691 46.5672 12.5148 8.7751 10.4265 6.8790 22.7795 36.6097 7.8330 6.5031 21.6994 9.2970 50.4005 3.3354 5.1056 14.5816 4.6122 1.1044 6.0834 18.6017 1.4202 0.7608 1.9447 19.5992 108.9373 251.1353 25.0821 34.0009 109.6860 15.2312 114.2572 8.8591 51.1297 11.0454 4.8988 13.4517 5.6383 40.3759 152.2160 13.1590 5.4407 35.4220 36.6789 27.5810 79.9372 10.1536 21.3443 92.8931 3.9994 132.4751 2.1898 49.7100 24.4944 245.1914 65.0377 46.2111 39.0967 54.2895 27.2996 304.5119 20.0541 33.2821 28.6219 57.8963 7.1625 14.1170 771.9702 55.0996 145.3345 144.2490 68.6270 498.3336 85.8037 170.5089 589.0022 307.2946 163.5964 212.3263 131.6601 89.7845 10.3830 15.5694 22.2825 12.9024 87.5708 10.1717 6.3123 21.6491 9.9766 29.8624 10.7281 20.2350 5.0015 2.1444 261.7338 53.7317 20.4970 48.5609 40.5862 29.4282 100.7923 41.1193
temp: 298.150 k
press: 1.00000 atm
elementType: 8 8 8 8 8 8 7 7 7 7 7 7 7 6 6 6 6 6 6 6 6 6 6 6 6 6 6 6 6 6 6 6 1 1 1 1 1 1 1 1 1 1 1 1 1 1 1 1 1 1 1 1 1 1 1
symmnumber: 1
zpe: 1116903.4 jmol-1
zpe.correction: 0.425406 hartree
zpe.thermalcorrener: 0.456382 hartree
zpe.thermalcorrenthalpy: 0.457327 hartree
zpe.thermalcorrgfe: 0.357166 hartree
zpe.sumelectzpe: -1570.124146 hartree
zpe.sumelectthermal: -1570.093170 hartree
zpe.sumelectthermalent: -1570.092225 hartree
zpe.sumelectthermalfe: -1570.192386 hartree
dipole: 3.5225 1.6362 -12.0517
dipole: 12.6621
quadrupole: -177.2993 -161.4153 -199.0060
quadrupole: 28.3349 -26.4653 -8.6250
quadrupole: 1.9409 17.8249 -19.7658 28.3349 -26.4653 -8.6250
hfenergy: -1570.5495521 hartree
pointgroup: C01 [X(C19H23N7O6)]
dipole: -1.5302217 -0.5812672 -4.7050278 debye
polarizability: 392.0674767|20.6701097|232.6031816|4.495548|-2.3255666|269.0551538 unknown
InChI: InChI=1S/C19H23N7O6/c20-19-25-15-14(17(30)26-19)23-11(8-22-15)7-21-10-3-1-9(2-4-10)16(29)24-12(18(31)32)5-6-13(27)28/h1-4,11-12,21-25,27,31H,5-8,20H2
charge 0 multiplicity 1
55 atoms
O  -6.224187 0.472342 2.634096
O  4.016068 0.515134 2.266449
O  7.980103 1.454697 -0.743135
O  6.046509 1.841674 -1.966913
O  6.150666 -3.86834 -1.647949
O  7.015172 -3.554762 0.483685
N  -4.86261 1.466957 0.431515
N  -5.392137 0.22246 -2.103114
N  -2.078891 1.480528 0.295749
N  -6.533819 -1.556482 -0.908281
N  -6.923378 -1.462392 1.466165
N  4.454009 0.856376 0.020881
N  -7.673305 -3.302494 0.220309
C  -4.241169 2.036758 -0.768236
C  -5.11298 1.674184 -2.022831
C  -2.780476 1.531046 -0.980005
C  -5.626653 0.295207 0.329947
C  -5.804808 -0.348575 -0.881024
C  -0.709757 1.289373 0.439048
C  -6.282148 -0.209679 1.557043
C  -7.026225 -2.078207 0.29051
C  5.897481 0.737667 0.243008
C  6.37549 -0.733955 0.444166
C  0.175961 1.244017 -0.681456
C  -0.149701 1.139262 1.747737
C  2.116432 0.938931 0.808435
C  1.559641 1.075516 -0.490747
C  1.227589 0.966775 1.920244
C  6.049094 -1.635588 -0.758089
C  3.571375 0.755437 1.092966
C  6.602606 1.400813 -0.932989
C  6.464297 -3.074546 -0.529804
H  -4.211123 3.136542 -0.652288
H  -6.072182 2.216928 -1.952669
H  -4.604088 1.990091 -2.949417
H  -2.271127 2.231631 -1.671186
H  -2.794848 0.531232 -1.475914
H  -5.069793 2.031673 1.26069
H  -4.761019 -0.327747 -2.695378
H  -2.691322 1.303754 1.09943
H  -6.858794 -1.902607 -1.813155
H  6.166026 1.281758 1.170834
H  7.461303 -0.728924 0.641864
H  5.876269 -1.111407 1.352069
H  -0.216652 1.328551 -1.699477
H  -0.813452 1.162901 2.620635
H  4.157711 1.199136 -0.896294
H  2.192558 1.029452 -1.385826
H  1.6594 0.847751 2.919443
H  4.96327 -1.622346 -0.972813
H  6.545221 -1.289952 -1.686714
H  -7.565055 -3.938466 -0.565476
H  -8.055954 -3.650193 1.096876
H  8.410191 1.890892 -1.527825
H  6.43281 -4.80618 -1.467291
