program: Gaussian 09
title: 000189682
version: EM64L-G09RevD.01
frameworkgroup: C1[X(C17H20N2O6S2)]
method: RPBEPBE
basis: SDD
operation: Freq
keyword: #p
keyword: freq=noraman
keyword: PBEPBE/SDD
title: #p freq=noraman PBEPBE/SDD
converged: YES YES NO NO
title: Mulliken charges:
elementType: S S O O O O O O N N C C C C C C C C C C C C C C C C C H H H H H H H H H H H H H H H H H H H H
charge: 0.141779 0.102568 -0.445009 -0.231366 -0.242614 -0.284613 -0.214961 -0.426620 -0.145152 -0.284650 -0.131192 0.159342 -0.333237 -0.577020 -0.573693 -0.046017 0.001140 0.222521 0.285381 -0.339629 0.359326 0.287009 -0.091309 -0.735930 -0.742853 -0.376637 -0.717595 0.306692 0.271815 0.322267 0.307911 0.265246 0.242891 0.351268 0.372013 0.257433 0.206952 0.223685 0.217393 0.216343 0.260636 0.239857 0.238376 0.239019 0.240687 0.222423 0.378125
chargesum: 0.00000
title: Mulliken charges with hydrogens summed into heavy atoms:
elementType: S S O O O O O O N N C C C C C C C C C C C C C C C C C
charge: 0.141779 0.102568 -0.072996 -0.231366 -0.242614 -0.284613 -0.214961 -0.048495 -0.145152 0.066618 0.175500 0.159342 -0.333237 0.017063 -0.000536 -0.046017 0.001140 0.222521 0.285381 -0.339629 0.359326 0.287009 0.151582 -0.047861 -0.048482 0.101596 -0.015465
polarizability: 2.66975693e+02 2.62049249e+00 2.59807507e+02 1.27022013e+01 -1.08320201e+01 1.95354036e+02
1716.lowfreq: -4.6777 -0.0025 -0.0015 -0.0014 5.6341 7.2210 19.0728 23.7325 47.7169
frequency: 18.9399 23.2477 47.7075 59.6877 83.1395 100.4126 106.1346 124.0247 139.7990 142.5919 155.0578 170.6594 181.8668 211.9311 216.3586 229.0650 240.0857 251.9662 268.3589 272.6785 274.2257 286.1567 295.6910 306.4634 306.6677 313.7834 319.6374 340.6874 355.6789 368.1305 411.2468 412.0158 423.9156 437.8235 457.0169 478.1420 492.1351 503.6027 515.9614 527.4533 538.5221 554.6111 567.4558 584.0570 601.1515 604.9986 615.6668 646.9565 660.3848 678.2077 715.2549 735.0546 745.0620 756.2891 759.9182 782.4460 785.5553 839.5830 865.5140 880.0267 923.4998 927.7175 942.2671 945.6668 985.8532 993.2649 994.9957 1004.2951 1027.7428 1031.7358 1037.0957 1059.4404 1076.3423 1098.3375 1111.0202 1131.3105 1132.7197 1149.1284 1170.8253 1174.4919 1197.8233 1200.1622 1224.1843 1225.7114 1251.9227 1259.7702 1270.8412 1288.7600 1289.1160 1300.3939 1307.1741 1339.6046 1347.6405 1353.5089 1364.0987 1369.2107 1376.3278 1379.0818 1395.8784 1396.2351 1405.9587 1408.0166 1448.1319 1457.0391 1459.1974 1459.8543 1463.1250 1474.4685 1477.8915 1485.3459 1495.2159 1560.3281 1595.7654 1613.7723 1653.1468 2979.2310 2982.1296 2998.7210 3002.7291 3005.3042 3005.8062 3017.4421 3023.5622 3071.9026 3076.3438 3089.0776 3091.7057 3093.1696 3095.7288 3097.4551 3099.1991 3112.1048 3475.6976 3492.5449 3525.6147
redmass: 6.2727 5.7409 4.5611 5.1758 10.6769 5.7173 7.2590 7.2402 6.5147 6.1958 4.6794 8.6876 4.7626 1.6647 2.3927 1.1198 4.4452 4.8764 2.5134 2.9960 1.4626 2.4138 2.6618 4.5303 3.0132 3.0207 3.4878 10.0006 8.8889 5.2089 5.5420 3.6704 9.1403 7.2719 5.8435 5.0248 4.1712 1.2004 3.7751 3.5797 2.1997 3.2747 3.8071 2.7956 1.7197 2.6576 4.0762 4.7046 5.0199 3.8500 6.7631 6.2988 3.5338 5.1535 5.7863 6.8557 6.0208 3.1775 3.2956 3.8495 2.2608 2.5143 1.5405 1.9174 3.4659 2.9534 1.3417 3.2899 1.6033 3.3083 2.9261 1.8694 2.5505 4.9361 2.6539 1.9103 2.3402 2.0201 2.4093 4.0406 2.1159 2.6926 2.1286 1.6109 2.0315 2.1639 1.7413 2.2657 1.4536 3.0399 1.5563 1.5765 1.9246 1.3100 2.1602 2.1074 1.4306 1.2126 1.4486 1.4086 1.7022 1.8857 1.1556 1.0471 1.0915 1.1077 1.0470 1.0579 1.0529 1.0664 1.0601 9.6973 9.7042 8.7659 7.9412 1.0360 1.0364 1.0410 1.0631 1.0782 1.0728 1.0808 1.0624 1.1002 1.0996 1.1021 1.0982 1.1000 1.0950 1.0990 1.1028 1.1003 1.0653 1.0650 1.0778
irintensity: 0.8265 0.6035 0.2290 0.6979 1.1286 3.2032 2.9527 0.9012 0.6805 9.8950 0.3069 6.2018 1.3890 0.8929 2.1405 0.0543 0.6351 4.2108 0.1127 3.7861 0.5025 1.4004 1.5330 2.4807 0.9613 5.0750 10.7410 6.4615 12.2576 22.7513 4.2064 0.9300 2.5798 10.3417 7.4776 6.5863 21.4819 146.5607 3.7461 8.2441 23.9526 32.4510 14.8437 61.1675 164.6035 47.9482 16.3106 12.9481 1.2073 69.5455 6.1371 1.9797 1.5731 4.1727 5.5583 3.8247 80.3948 0.8716 21.8630 11.0766 9.7375 36.0447 1.7710 50.8566 62.2157 42.3195 8.0628 18.0211 25.4530 10.9532 77.8758 17.8574 15.7363 1.0619 46.2597 22.3970 16.0733 62.2725 9.2952 18.6805 1.1491 10.7446 51.4537 26.5883 4.9868 46.4956 22.1707 9.4860 51.4080 83.0989 2.0220 59.1060 128.9028 8.0177 45.1789 14.7244 42.1798 26.4987 19.5660 91.3320 7.5959 50.8749 31.9452 7.2933 38.7620 12.0426 7.9091 25.4739 9.6764 9.7225 18.7958 90.6678 69.4411 323.8831 310.5511 22.9265 27.6005 17.0670 18.0313 15.3911 11.0746 8.1677 5.0065 15.0191 48.5773 12.5069 19.4233 3.2764 4.3499 14.1915 1.1532 20.6092 26.4778 32.6664 46.3843
temp: 298.150 k
press: 1.00000 atm
elementType: 16 16 8 8 8 8 8 8 7 7 6 6 6 6 6 6 6 6 6 6 6 6 6 6 6 6 6 1 1 1 1 1 1 1 1 1 1 1 1 1 1 1 1 1 1 1 1
symmnumber: 1
zpe: 936884.1 jmol-1
zpe.correction: 0.356840 hartree
zpe.thermalcorrener: 0.382587 hartree
zpe.thermalcorrenthalpy: 0.383531 hartree
zpe.thermalcorrgfe: 0.302269 hartree
zpe.sumelectzpe: -2014.775435 hartree
zpe.sumelectthermal: -2014.749689 hartree
zpe.sumelectthermalent: -2014.748744 hartree
zpe.sumelectthermalfe: -2014.830006 hartree
dipole: 2.1382 2.2746 -0.9100
dipole: 3.2518
quadrupole: -161.5311 -180.0127 -182.4376
quadrupole: 4.9830 -2.0844 9.2970
quadrupole: 13.1294 -5.3522 -7.7772 4.9830 -2.0844 9.2970
hfenergy: -2015.1322751 hartree
pointgroup: C01 [X(C17H20N2O6S2)]
dipole: 0.7495825 -1.0350023 0.0601161 debye
polarizability: 267.9302785|0.6683825|259.0970804|-9.3332957|13.2163199|195.1098776 unknown
InChI: InChI=1S/C17H20N2O6S2/c1-7-14(2,3)10-8(25-7)4-9-15(24,11(10)21)5-17-12(22)18-16(6-20,26-27-17)13(23)19(9)17/h7,9,18,20,24H,4-6H2,1-3H3
charge 0 multiplicity 1
47 atoms
S  -3.360485 2.028118 0.467861
S  -4.439018 0.04947 0.003081
O  0.833316 2.415175 2.707106
O  2.201111 -2.14708 0.682515
O  2.427171 2.543372 0.344516
O  -1.801716 -2.116269 1.127238
O  -0.960072 1.887566 -2.257966
O  -2.200842 -3.101866 -1.509695
N  -1.235469 0.157341 0.837978
N  -2.18399 -0.04272 -1.736024
C  -0.251699 0.370798 1.940051
C  0.476201 1.678241 1.494915
C  -1.541171 1.385922 0.102535
C  -0.575834 2.453729 0.63284
C  0.684436 -0.839728 2.163356
C  1.78391 1.482307 0.65825
C  2.176616 0.139434 0.327939
C  3.320544 -0.331289 -0.581393
C  1.663008 -0.930438 1.034614
C  -2.818907 -0.839236 -0.716236
C  -1.904883 -1.005286 0.517391
C  -1.510863 1.131599 -1.41737
C  3.047408 -1.884057 -0.583306
C  3.225965 0.242852 -2.015221
C  4.680106 0.057066 0.061953
C  -3.316647 -2.209707 -1.230977
C  4.225427 -2.846194 -0.564299
H  -0.793751 0.589294 2.88027
H  -1.091679 3.159004 1.307944
H  -0.119199 3.013976 -0.19848
H  0.103909 -1.768961 2.269911
H  1.230411 -0.665445 3.110531
H  2.351285 -2.125999 -1.410353
H  -2.305699 -0.285504 -2.723293
H  1.510494 3.094206 2.438105
H  3.346224 1.339169 -1.990205
H  4.021767 -0.177208 -2.658795
H  2.24736 0.019682 -2.477524
H  4.790226 -0.367908 1.076307
H  5.526476 -0.292937 -0.556939
H  4.740545 1.155692 0.142422
H  -3.854114 -2.075241 -2.184383
H  -4.007703 -2.638401 -0.479658
H  4.889558 -2.658932 0.294762
H  3.868212 -3.888788 -0.512185
H  4.81437 -2.733023 -1.492635
H  -1.806016 -3.34659 -0.62765
