program: Gaussian 09
title: 000189670
version: EM64L-G09RevD.01
frameworkgroup: C1[X(C18H20O5)]
method: RPBEPBE
basis: SDD
operation: Freq
keyword: #pfreq=noraman
keyword: PBEPBE/SDD
title: #p freq=noraman PBEPBE/SDD
converged: YES YES NO NO
title: Mulliken charges:
elementType: O O O O O C C C C C C C C C C C C C C C C C C H H H H H H H H H H H H H H H H H H H H
charge: -0.270820 -0.269013 -0.269406 -0.226679 -0.423353 -0.511174 0.229074 -0.535470 0.217314 0.196708 0.118164 -0.546534 -0.558756 0.346082 0.296246 -0.315943 -0.332970 -0.408719 -0.352530 0.294004 -0.533363 -0.533128 -0.536034 0.246370 0.250109 0.251748 0.255596 0.260440 0.251552 0.249753 0.280423 0.221491 0.255412 0.218929 0.243723 0.223235 0.213776 0.219380 0.246673 0.218849 0.216614 0.244919 0.357307
chargesum: 0.00000
title: Mulliken charges with hydrogens summed into heavy atoms:
elementType: O O O O O C C C C C C C C C C C C C C C C C C
charge: -0.270820 -0.269013 -0.269406 -0.226679 -0.066046 -0.014695 0.229074 -0.028126 0.217314 0.196708 0.118164 -0.286094 -0.307204 0.346082 0.296246 -0.066190 -0.052547 -0.187228 -0.097118 0.294004 0.152524 0.146702 0.144348
polarizability: 2.94293663e+02 -2.76292836e+00 1.90248536e+02 7.32429646e+00 -4.35967234e+00 1.85498397e+02
1716.lowfreq: -9.6931 -7.5925 -2.0906 -0.0009 -0.0007 0.0003 1.0235 23.1764 27.1227
frequency: -7.0278 23.0775 27.0995 37.7053 55.9300 81.3060 89.0597 98.6919 110.1076 114.3199 135.8582 164.2132 182.6498 194.1259 199.6404 216.6359 239.3481 260.4208 263.1200 279.5831 281.7313 298.8840 317.5451 353.7498 370.2503 383.9681 396.1348 411.6954 429.4469 482.6344 485.5697 495.3352 514.0601 552.3553 566.6634 591.4416 594.4481 622.7252 630.7546 631.0567 725.0457 727.7489 737.4633 780.6864 790.9463 805.3764 807.1257 830.9159 845.3725 851.9923 868.9003 903.6758 940.5146 969.6371 990.0737 993.0384 1001.8156 1002.5878 1033.1447 1069.8695 1091.1544 1103.1445 1110.9976 1111.9143 1112.8635 1132.1817 1142.2182 1149.7628 1155.5494 1158.8484 1165.1149 1180.3390 1198.8819 1214.3335 1228.1571 1253.9946 1288.2130 1292.4635 1301.1002 1308.1728 1348.2083 1395.8679 1400.4219 1411.8499 1428.0562 1430.3935 1433.0775 1444.3061 1447.2887 1455.3215 1465.3210 1465.5153 1467.6131 1468.1194 1473.1116 1475.8019 1496.1398 1501.0888 1565.3691 1597.2831 1601.2630 1613.5712 1621.1691 2953.4658 2954.7885 2959.5447 2971.1567 3021.8607 3036.4345 3039.6081 3040.6029 3047.4904 3100.7601 3115.5949 3120.3502 3120.8615 3122.1428 3152.3713 3157.8025 3174.4776 3184.1559 3186.1168 3576.9267
redmass: 5.0223 4.6593 5.4589 4.7954 3.3135 3.3977 3.8003 4.0130 4.1799 3.6470 5.2510 3.1697 1.7537 1.6956 3.4248 4.5008 1.1593 1.9933 2.3467 3.0386 2.5831 5.5741 3.0203 4.5514 5.5707 1.1356 4.6097 2.8548 4.8529 4.6565 3.0558 6.1394 5.8363 5.5982 2.0881 6.7982 3.8720 2.9596 6.7272 3.3580 3.0568 5.6256 2.5412 1.6220 1.6955 4.6435 1.4308 2.8628 3.5744 1.5423 4.5465 7.1155 1.3785 5.6830 1.7109 5.7353 1.9137 2.5581 3.6046 3.3379 3.7119 1.3982 1.2601 1.2619 1.2592 2.2496 1.3812 1.3842 1.3656 1.5315 1.6130 1.1278 2.2721 1.9477 1.4652 2.6730 1.1943 2.0003 5.3229 1.3250 1.6491 5.1987 4.6697 2.3706 1.3899 2.1134 1.1549 1.2137 1.4803 1.1139 1.0518 1.0510 1.0819 1.1977 1.0527 1.0629 2.4571 2.6278 7.4578 7.4174 7.5431 7.7933 6.3302 1.0331 1.0333 1.0328 1.0593 1.0983 1.0595 1.1037 1.1036 1.1038 1.1031 1.0895 1.0989 1.0989 1.0997 1.0886 1.0941 1.0969 1.0907 1.0900 1.0660
irintensity: 0.8709 2.0738 0.4293 0.0990 2.6759 12.2199 2.3065 0.6948 0.1692 0.6396 2.1898 1.1822 1.5709 3.0775 2.8280 4.3466 0.8273 2.3276 4.2336 0.2672 0.2536 0.3002 1.6566 0.7977 4.7919 141.9720 33.8179 2.3748 7.5429 5.2093 10.8302 17.1419 11.2416 3.5101 13.1427 13.0880 0.0336 14.4111 2.4616 8.2119 1.6228 1.1905 4.9900 28.1689 7.7599 17.6993 14.1618 14.1493 47.6864 39.0986 0.6149 25.7491 0.0175 46.7902 5.0606 23.6615 5.9605 0.8433 63.3793 1.2931 240.9320 50.1931 0.1433 0.9071 0.3027 108.1239 337.2995 34.3402 47.8652 93.0668 61.2668 52.6731 6.6148 80.3808 23.3206 19.0536 12.0376 147.5867 66.8976 24.0809 50.8813 2.6537 14.9900 62.4120 12.0697 10.0997 25.5351 2.3763 43.2370 17.7104 11.0887 0.8732 39.3271 67.2534 51.5759 21.8752 44.0215 18.8621 185.2951 184.2745 56.9736 208.9664 114.8129 3.8658 141.1280 66.4761 30.9530 5.8848 8.0857 25.0543 73.3258 47.1447 5.9972 18.9753 36.8037 12.0020 22.1582 0.2192 10.2662 8.8180 3.0508 5.5125 56.3840
temp: 298.150 k
press: 1.00000 atm
elementType: 8 8 8 8 8 6 6 6 6 6 6 6 6 6 6 6 6 6 6 6 6 6 6 1 1 1 1 1 1 1 1 1 1 1 1 1 1 1 1 1 1 1 1
symmnumber: 1
zpe: 894814.8 jmol-1
zpe.correction: 0.340817 hartree
zpe.thermalcorrener: 0.363181 hartree
zpe.thermalcorrenthalpy: 0.364126 hartree
zpe.thermalcorrgfe: 0.288178 hartree
zpe.sumelectzpe: -1072.293337 hartree
zpe.sumelectthermal: -1072.270973 hartree
zpe.sumelectthermalent: -1072.270029 hartree
zpe.sumelectthermalfe: -1072.345976 hartree
dipole: 2.7398 -2.3894 5.3088
dipole: 6.4342
quadrupole: -121.9668 -115.2410 -133.6492
quadrupole: -7.4092 -12.8052 -0.2476
quadrupole: 1.6522 8.3780 -10.0302 -7.4092 -12.8052 -0.2476
hfenergy: -1072.6341543 hartree
pointgroup: C01 [X(C18H20O5)]
dipole: -1.1012226 -1.3343284 -1.8479408 debye
polarizability: 294.425023|2.8296668|191.705863|6.3318123|2.9395013|183.9097102 unknown
InChI: InChI=1S/C18H20O5/c1-21-14-10-17(22-2)15(18(11-14)23-3)8-9-16(20)12-4-6-13(19)7-5-12/h4-7,10-11,19H,8-9H2,1-3H3
charge 0 multiplicity 1
43 atoms
O  -1.725544 2.600157 -0.094529
O  -1.748512 -1.883064 1.514852
O  -5.542554 -0.182654 -1.203464
O  2.185904 0.825387 2.365336
O  6.964125 -0.909245 -1.568288
C  -0.451307 0.59454 1.408669
C  -1.782375 0.360286 0.721077
C  0.73746 0.184942 0.507544
C  -2.4287 1.383082 -0.028862
C  -2.441611 -0.892543 0.788862
C  2.098279 0.378043 1.181605
C  -3.67741 1.183173 -0.658318
C  -3.69676 -1.135047 0.170581
C  -4.301424 -0.078509 -0.546611
C  3.338356 0.023675 0.412709
C  3.303111 -0.480771 -0.914702
C  4.605393 0.200322 1.039591
C  4.492576 -0.799763 -1.598932
C  5.798277 -0.112757 0.371469
C  5.740188 -0.614528 -0.952341
C  -2.366966 3.719039 -0.786072
C  -2.400231 -3.177338 1.706509
C  -6.249966 -1.459366 -1.115561
H  -0.402881 0.010912 2.342817
H  -0.348435 1.65907 1.674153
H  0.713337 0.772331 -0.432725
H  0.630584 -0.87913 0.214368
H  -4.185458 1.962907 -1.229372
H  -4.178822 -2.111433 0.246497
H  2.345067 -0.62715 -1.423272
H  4.618355 0.589824 2.06284
H  4.452667 -1.188165 -2.625054
H  6.775756 0.01958 0.844165
H  -2.524105 3.494034 -1.859106
H  -1.665676 4.560255 -0.682238
H  -3.336109 3.978722 -0.317813
H  -2.564763 -3.696081 0.741202
H  -3.365733 -3.069514 2.238559
H  -1.701589 -3.76177 2.323534
H  -6.488081 -1.718402 -0.064974
H  -5.66449 -2.279902 -1.575808
H  -7.182738 -1.31123 -1.679675
H  6.828203 -1.250421 -2.487323
