program: Gaussian 09
title: 000189658
version: EM64L-G09RevD.01
frameworkgroup: C1[X(C12H3Br7)]
method: RPBEPBE
basis: SDD
operation: Freq
keyword: #pfreq=noraman
keyword: PBEPBE/SDD
title: #p freq=noraman PBEPBE/SDD
converged: NO NO NO NO
title: Mulliken charges:
elementType: Br Br Br Br Br Br Br C C C C C C C C C C C C H H H
charge: 0.121634 0.121633 0.114158 0.092933 0.092932 0.082462 0.044623 0.446741 0.312554 -0.336974 -0.336975 -0.334990 -0.246918 -0.169838 -0.169837 -0.142365 -0.207165 -0.161876 -0.161598 0.272255 0.286385 0.280227
chargesum: 0.00000
title: Mulliken charges with hydrogens summed into heavy atoms:
elementType: Br Br Br Br Br Br Br C C C C C C C C C C C C
charge: 0.121634 0.121633 0.114158 0.092933 0.092932 0.082462 0.044623 0.446741 0.312554 -0.336974 -0.336975 -0.334990 0.025338 -0.169838 -0.169837 -0.142365 -0.207165 0.124509 0.118628
polarizability: 3.00532587e+02 1.36424946e-03 2.42293773e+02 1.25272686e+01 1.22863125e-03 2.16130310e+02
1716.lowfreq: -0.0003 -0.0002 -0.0002 1.7595 2.5979 5.2563 15.3964 24.4827 26.7812
frequency: 15.3580 24.4780 26.7745 39.0827 48.6719 60.0308 82.4355 121.1566 125.1095 132.9710 133.0252 135.2219 139.4822 182.9359 199.8044 205.9932 211.4042 212.5717 272.6194 303.3311 315.2247 315.2548 408.1720 434.7304 458.2896 459.1455 488.4091 535.4706 582.0929 586.8207 610.6916 649.3318 722.4478 722.8596 749.1093 758.6106 828.6406 879.3735 881.2014 887.7379 980.7944 1018.2412 1093.3741 1114.2853 1161.9822 1171.1932 1221.6372 1315.2600 1321.3233 1337.9585 1358.8060 1375.4140 1409.5022 1520.1229 1531.1167 1534.8688 1566.6542 3171.7892 3180.8297 3182.1751
redmass: 61.2124 46.5091 47.0831 76.0216 57.5789 43.5921 68.4880 59.3652 55.4004 14.4296 9.5771 16.1910 34.1024 40.2766 48.7827 65.3421 4.7910 71.1427 6.9412 8.7313 10.9066 11.8280 8.4537 6.6674 9.0927 6.5763 8.8042 5.1778 12.0230 5.0654 6.2821 9.3054 5.0795 9.2046 9.4800 11.4434 10.2271 1.4869 1.4077 1.3768 9.3105 9.3607 7.4321 1.8577 1.7262 2.8607 2.6390 11.7279 3.5153 7.6421 2.6689 2.9777 5.9851 7.5071 11.1832 7.5038 8.0373 1.0931 1.0934 1.0928
irintensity: 0.0005 0.0168 0.0146 0.0001 0.0030 0.0302 0.0041 0.0325 0.1012 0.1602 0.0044 0.1621 0.0106 0.0093 0.0005 0.0644 0.2043 0.0053 1.0514 0.7056 4.5484 0.1487 6.9062 19.6273 11.1441 0.0959 38.3393 8.4535 0.1152 1.6496 2.4411 19.8705 11.6965 19.4379 17.0666 1.3196 2.8489 17.5650 14.4556 1.8248 177.7565 34.0732 21.3836 26.2364 63.1206 4.9388 20.5273 4.7329 70.2571 8.6425 134.7259 93.2714 8.8167 11.5182 16.0562 68.2825 26.6547 0.2576 0.5628 0.9568
temp: 298.150 k
press: 1.00000 atm
elementType: 35 35 35 35 35 35 35 6 6 6 6 6 6 6 6 6 6 6 6 1 1 1
symmnumber: 1
zpe: 278211.9 jmol-1
zpe.correction: 0.105965 hartree
zpe.thermalcorrener: 0.126315 hartree
zpe.thermalcorrenthalpy: 0.127259 hartree
zpe.thermalcorrgfe: 0.049455 hartree
zpe.sumelectzpe: -551.950571 hartree
zpe.sumelectthermal: -551.930221 hartree
zpe.sumelectthermalent: -551.929277 hartree
zpe.sumelectthermalfe: -552.007081 hartree
dipole: -0.6024 0.0001 0.6699
dipole: 0.9009
quadrupole: -163.9565 -174.2998 -174.2970
quadrupole: 0.0000 0.2228 0.0002
quadrupole: 6.8946 -3.4487 -3.4459 0.0000 0.2228 0.0002
hfenergy: -552.0565359 hartree
pointgroup: C01 [X(C12H3Br7)]
dipole: 0.2318047 0.0000848 -0.2681402 debye
dipolederiv: -0.1438546 -0.2994567 -0.001447 -0.2421128 -0.4496167 -0.001186 -0.0074439 -0.0018995 0.0453387 -0.1437754 0.2994134 -0.0012303 0.2420699 -0.4497 0.0008281 -0.0072748 0.0015496 0.045339 -0.1312581 0.0001165 -0.2699516 0.0001074 0.0415931 0.0002037 -0.2440377 0.0002014 -0.4329372 -0.2574587 -0.3423918 0.0060921 -0.3457909 -0.4375835 0.0062422 0.0003034 0.0009655 0.0231881 -0.2573609 0.3423615 0.0063377 0.3457652 -0.4376773 -0.0065755 0.0005498 -0.0012943 0.0231822 -0.287287 -0.0001059 0.3334959 -0.0001081 0.0156142 0.0001311 0.3409402 0.0001314 -0.3921965 -0.2291096 0.0001261 -0.2810657 0.000145 -0.0052175 0.0002565 -0.3267426 0.0002574 -0.6050833 0.2093963 -0.0000177 -0.060757 -0.0000209 -0.3306297 -0.0001247 -0.0591365 -0.0001251 0.0355751 0.2144066 0.000046 -0.1498756 0.0000263 0.0588271 0.0000436 -0.0975784 0.0000454 -0.0329055 0.0401849 0.51102 0.0163773 0.6316323 0.5901888 0.0030825 0.0170028 -0.0182486 -0.0904331 0.040018 -0.5109488 0.0160074 -0.6315603 0.5903457 -0.0025911 0.0165604 0.0187253 -0.0904222 -0.0735464 -0.0002038 0.5321403 -0.0002418 -0.0910824 -0.0002931 0.6254077 -0.000297 0.5593199 -0.3153714 0.0000643 -0.1156961 0.0000914 -0.0552411 0.0001034 -0.1797801 0.0001069 -0.2982482 0.3822311 0.5627424 -0.0070498 0.8148483 0.6299111 -0.0055258 0.0047146 -0.0054834 -0.0867312 0.3820313 -0.5627041 -0.0074552 -0.8148156 0.6301017 0.0060416 0.0041326 0.0059992 -0.0867225 0.4776186 0.0001616 -0.5337488 0.0002706 -0.0760829 -0.0002112 -0.8158418 -0.000193 0.5805575 0.4382329 -0.0002395 0.5107578 -0.0002755 -0.1112487 -0.000514 0.5986518 -0.0005192 1.1003443 -0.2366141 -0.0000171 0.0127891 -0.0000131 -0.421109 -0.0001434 -0.0020672 -0.0001429 -0.0215196 -0.2089622 0.0000314 -0.0469515 -0.0000121 -0.0351102 0.0002008 0.0689577 0.0001936 -0.5400161 0.072289 -0.0000152 0.0485821 -0.0000258 0.1220133 0.0000367 0.0761929 0.0000327 0.0231308 0.0178736 0.0000039 0.0000937 0.0000046 0.0700877 -0.00003 -0.0013972 -0.0000304 0.151862 0.0103159 0.0000137 -0.0074449 0.0000159 0.1516163 0.0000246 -0.0121137 0.0000248 0.0893777 unknown
polarizability: 300.9907049|-0.0087137|242.2937726|10.8653712|0.0053279|215.6721922 unknown
InChI: InChI=1S/C12H3Br7/c13-4-1-5(10(17)6(14)2-4)9-11(18)7(15)3-8(16)12(9)19/h1-3H
charge 0 multiplicity 1
22 atoms
Br 0.460283 -2.901181 -0.099373
Br 0.460712 2.901181 -0.097286
Br -0.643781 -0.001033 2.782619
Br 3.912577 2.859703 -0.089869
Br 3.91216 -2.860212 -0.091932
Br -4.09782 -0.000687 2.566628
Br -3.717878 0.001524 -3.186632
C  0.724251 -0.000019 -0.096919
C  -0.777142 0.000105 -0.126644
C  1.447164 -1.227724 -0.100464
C  1.447346 1.227578 -0.099571
C  -1.552852 -0.0003 1.065807
C  -1.425087 0.000644 -1.384939
C  2.863264 1.221137 -0.092805
C  2.863081 -1.221494 -0.093693
C  -2.967197 -0.000162 0.980348
C  -2.830655 0.000774 -1.446109
C  3.565849 -0.000231 -0.088701
C  -3.613692 0.000376 -0.27574
H  -0.823803 0.000957 -2.298042
H  4.658321 -0.000315 -0.08328
H  -4.705003 0.00048 -0.329501
