program: Gaussian 09
title: 000189634
version: EM64L-G09RevD.01
frameworkgroup: C1[X(C16H12N2O)]
method: RPBEPBE
basis: SDD
operation: Freq
keyword: #p
keyword: freq=noraman
keyword: PBEPBE/SDD
title: #p freq=noraman PBEPBE/SDD
converged: YES YES NO NO
title: Mulliken charges:
elementType: O N N C C C C C C C C C C C C C C C C H H H H H H H H H H H H
charge: -0.195254 -0.139990 -0.004334 0.350749 0.122788 -0.363695 -0.381633 -0.260242 0.429494 -0.012408 -0.238385 -0.229594 -0.240825 -0.356770 -0.363747 -0.347173 -0.232245 -0.221130 -0.226058 0.219058 0.271464 0.269101 0.226557 0.227455 0.229910 0.232725 0.282225 0.254108 0.232075 0.232639 0.233136
chargesum: 0.00000
title: Mulliken charges with hydrogens summed into heavy atoms:
elementType: O N N C C C C C C C C C C C C C C C C
charge: -0.195254 -0.139990 -0.004334 0.350749 0.122788 -0.144636 -0.110170 0.008859 0.429494 -0.012408 -0.011829 -0.002138 -0.010915 -0.124044 -0.081522 -0.093065 -0.000169 0.011509 0.007078
polarizability: 4.40714067e+02 1.79115297e+01 1.99571407e+02 1.21080054e-01 -1.24894619e-01 7.14993465e+01
1716.lowfreq: -5.3139 -2.6035 -0.0009 -0.0007 0.0004 1.8098 22.1858 27.9401 41.0230
frequency: 22.1458 27.9204 40.9444 64.8507 98.2543 117.9304 146.2322 177.3129 242.5352 272.6762 294.5738 349.1505 368.4887 402.9254 405.1137 414.9968 492.9190 499.6602 536.8521 583.5478 614.0951 615.6735 647.6156 671.7986 694.2408 698.5332 704.4190 753.5858 771.0086 775.7947 788.7681 826.9708 854.2287 857.6498 898.9495 927.9570 931.3751 935.4896 981.9206 987.6771 988.1011 989.1545 996.1954 1002.6064 1010.9764 1018.4926 1021.4911 1036.9525 1079.5546 1082.6826 1096.1634 1156.2061 1173.1335 1173.9859 1182.0771 1188.7654 1231.5120 1249.4828 1283.5544 1316.1486 1327.9745 1353.7631 1383.0502 1392.5686 1436.1578 1439.8159 1462.4329 1469.3709 1497.8328 1550.6263 1568.1338 1588.1198 1591.5281 1614.0885 1620.8481 3006.7955 3122.6050 3122.8263 3131.2494 3133.0238 3144.2406 3146.4382 3158.5251 3159.9772 3169.7077 3170.6475 3271.9095
redmass: 3.7067 4.3425 5.6606 5.0942 5.8218 5.0991 5.3155 5.7134 3.0317 4.8381 6.4275 7.6427 5.9719 2.8264 2.8406 5.7850 3.1586 3.5212 6.3168 6.7541 6.4904 6.4573 2.6341 6.6768 2.1956 1.8671 3.4418 1.4530 9.4718 1.8000 2.3267 5.3260 1.2540 1.2505 7.6891 7.0339 1.4517 1.3751 1.3764 6.2608 1.4135 6.2409 1.5476 1.3335 1.3761 3.6638 2.1520 3.2460 1.5991 1.5842 2.5353 4.9360 1.0564 1.0721 1.1385 1.1201 2.1546 2.0948 2.8125 1.4935 1.4917 1.8432 8.0870 7.0800 2.4592 2.3329 2.5258 2.5386 4.0101 5.9154 6.6250 6.2212 5.7912 6.2948 6.1215 1.0881 1.0871 1.0855 1.0878 1.0876 1.0933 1.0921 1.0962 1.0962 1.1000 1.1005 1.0998
irintensity: 0.2147 0.1207 0.4851 1.8401 1.8172 0.1908 4.4981 1.4057 11.5244 1.0261 3.9061 0.5064 1.8059 0.0303 0.3560 0.5082 3.1237 22.5651 1.0890 27.1392 0.0070 0.0511 1.0648 24.3691 63.2665 27.6797 3.0896 116.9120 1.6520 41.2235 9.5662 14.5119 0.0305 0.2821 16.0436 25.8189 5.3060 0.2214 0.0493 1.6016 5.2153 0.0568 13.9886 1.0301 4.4453 17.1351 7.8182 2.5041 9.0880 7.1954 20.8194 57.6838 0.2667 0.4442 8.1634 3.9365 8.2757 16.4066 14.1181 11.9907 0.3785 10.9241 0.6189 4.6366 7.8061 26.6439 4.9959 70.3885 37.9339 14.6758 141.6599 0.9076 57.9410 1.5062 2.6045 27.2657 5.2622 6.6569 1.1476 0.1299 28.7994 21.4130 30.2724 21.9497 22.4216 29.8745 3.8017
temp: 298.150 k
press: 1.00000 atm
elementType: 8 7 7 6 6 6 6 6 6 6 6 6 6 6 6 6 6 6 6 1 1 1 1 1 1 1 1 1 1 1 1
symmnumber: 1
zpe: 620911.4 jmol-1
zpe.correction: 0.236493 hartree
zpe.thermalcorrener: 0.251574 hartree
zpe.thermalcorrenthalpy: 0.252518 hartree
zpe.thermalcorrgfe: 0.191430 hartree
zpe.sumelectzpe: -800.306114 hartree
zpe.sumelectthermal: -800.291033 hartree
zpe.sumelectthermalent: -800.290088 hartree
zpe.sumelectthermalfe: -800.351176 hartree
dipole: 0.3723 1.1585 -0.0063
dipole: 1.2169
quadrupole: -77.8020 -98.8459 -117.1262
quadrupole: 7.5842 0.0219 -0.0380
quadrupole: 20.1226 -0.9212 -19.2015 7.5842 0.0219 -0.0380
hfenergy: -800.5426068 hartree
pointgroup: C01 [X(C16H12N2O1)]
dipole: 0.1441399 -0.455148 -0.0356361 debye
polarizability: 440.5179809|-18.946395|198.9008979|-3.163896|10.465609|72.3659423 unknown
InChI: InChI=1S/C16H12N2O/c1-3-7-13(8-4-1)11-17-16-18-15(12-19-16)14-9-5-2-6-10-14/h1-12H
charge 0 multiplicity 1
31 atoms
O  -0.474957 2.286133 0.206347
N  -0.889199 0.037661 0.019044
N  1.440246 0.902452 0.078989
C  -3.412939 0.018227 0.026491
C  -2.123805 0.725276 0.081293
C  -4.647474 0.720256 0.092801
C  -3.431909 -1.397222 -0.09567
C  -1.860761 2.090563 0.1960
C  3.511719 -0.362792 -0.031193
C  0.069793 0.968872 0.091692
C  -5.870857 0.021879 0.038263
C  -4.657332 -2.093124 -0.150081
C  -5.882222 -1.388318 -0.083552
C  4.122742 -1.645037 -0.130963
C  4.335148 0.798208 0.050502
C  2.051345 -0.264044 -0.014595
C  5.527407 -1.766948 -0.148852
C  5.735976 0.672255 0.032191
C  6.336986 -0.609238 -0.067327
H  -4.655786 1.812589 0.186841
H  -2.476562 -1.928645 -0.146266
H  -2.470447 2.984063 0.273694
H  -6.815355 0.574806 0.090437
H  -4.658705 -3.184754 -0.244267
H  -6.833949 -1.929346 -0.125941
H  3.491148 -2.540085 -0.193964
H  3.846048 1.774532 0.126708
H  1.480123 -1.209865 -0.082946
H  5.991178 -2.75623 -0.225853
H  6.366598 1.56584 0.094944
H  7.428702 -0.702467 -0.081068
