program: Gaussian 09
title: 000189607
version: EM64L-G09RevD.01
frameworkgroup: C1[X(C19H21NO4)]
method: RPBEPBE
basis: SDD
operation: Freq
keyword: #p
keyword: freq=noraman
keyword: PBEPBE/SDD
title: #p freq=noraman PBEPBE/SDD
converged: NO YES NO NO
title: Mulliken charges:
elementType: O O O O N C C C C C C C C C C C C C C C C C C C H H H H H H H H H H H H H H H H H H H H H
charge: -0.262248 -0.290710 -0.303911 -0.422544 -0.253756 -0.272878 0.072540 -0.680526 0.218228 0.164792 -0.515954 -0.478861 0.416107 0.014422 -0.017602 0.078724 0.048585 0.205543 -0.504003 -0.434551 -0.211890 -0.496346 -0.531252 -0.525963 0.252394 0.253063 0.217674 0.226423 0.236823 0.243654 0.228795 0.220288 0.242061 0.212951 0.223665 0.350227 0.224710 0.204031 0.251415 0.222763 0.247174 0.222632 0.222257 0.208301 0.272754
chargesum: 0.00000
title: Mulliken charges with hydrogens summed into heavy atoms:
elementType: O O O O N C C C C C C C C C C C C C C C C C C C
charge: -0.262248 -0.290710 -0.303911 -0.072317 -0.010102 -0.020484 0.072540 -0.209790 0.218228 0.164792 -0.052708 -0.029777 0.416107 0.014422 -0.017602 0.078724 0.048585 0.205543 -0.261942 -0.221600 0.011775 0.183810 0.161317 0.177349
polarizability: 3.17786747e+02 6.43981541e+00 2.51981332e+02 -5.47611637e+00 1.14029108e+01 1.40229984e+02
1716.lowfreq: -7.2637 -0.0009 -0.0008 0.0004 4.7150 10.4164 36.0497 49.4451 63.3765
frequency: 35.9306 49.4385 63.3666 76.3410 92.1138 98.2607 117.0285 129.5112 136.1565 151.4848 165.7362 180.5666 188.3253 197.9092 221.6106 233.1573 243.0129 264.4933 272.0403 289.0543 298.6124 316.5378 330.3834 341.7249 352.5179 401.6257 412.6157 429.1761 432.7655 462.2836 502.1032 508.2653 534.3374 536.7052 545.3145 573.6763 580.5274 602.8556 671.8630 680.7061 702.2244 726.5496 732.3729 759.3383 775.7284 799.7843 812.5049 816.9326 860.2477 879.8242 887.9362 902.7687 933.2230 951.4300 957.9263 968.7012 986.4356 1010.9913 1036.2243 1061.9921 1077.3780 1085.3970 1108.5893 1109.7192 1112.4751 1115.5809 1132.6990 1141.5777 1148.4770 1154.5334 1158.4598 1164.7223 1169.2010 1180.4128 1193.9403 1221.2934 1231.4502 1251.9733 1267.9337 1292.8505 1299.0218 1306.4373 1323.7326 1333.2963 1351.4006 1368.0502 1381.7051 1394.7604 1405.7989 1425.8496 1434.6011 1443.0863 1444.4959 1450.3872 1452.2588 1455.6482 1456.7735 1458.3905 1459.6364 1463.6630 1472.8615 1474.1939 1485.2744 1488.3970 1560.9438 1582.7577 1589.8111 1611.6190 2941.4776 2957.1965 2964.1265 2966.5238 2967.0078 2976.0121 2990.3414 3022.8054 3055.5439 3056.0610 3063.7333 3069.9551 3085.8242 3109.4927 3111.4049 3117.1923 3122.4462 3130.8531 3156.5671 3389.6024 3580.6965
redmass: 3.3936 3.6116 3.3215 3.5963 3.2417 4.6444 2.6100 2.7223 1.6824 1.7687 1.2401 3.1711 3.4508 1.3314 3.0956 2.6615 2.9430 1.4748 4.4533 3.5446 3.8601 4.2661 3.1874 5.4511 5.1194 5.9218 5.1242 3.6638 5.0624 4.6698 4.2652 4.5613 3.8230 3.9525 5.6670 4.0479 3.7600 4.3425 5.7448 4.8601 2.3588 5.8413 2.1612 2.1730 2.6397 4.0228 5.1673 6.5826 1.3908 2.5326 6.2581 4.1369 2.7868 1.3980 3.1096 5.7519 2.4174 3.3082 5.4406 3.1510 2.2894 2.5846 1.3710 1.2471 1.4580 1.6207 2.6953 1.9273 1.3658 1.5377 1.4163 1.4797 1.4472 1.5467 1.3351 1.3067 2.4792 2.0622 2.9416 1.7638 1.5957 2.2595 1.8886 1.4718 1.5700 4.1896 4.1366 2.8707 2.9389 1.4182 1.2333 1.1969 1.3552 1.9096 1.1126 1.0957 1.1712 1.3525 1.0861 1.1061 1.0517 1.0570 1.0634 3.2429 8.6645 8.9396 6.8922 7.2232 1.0724 1.0769 1.0330 1.0508 1.0440 1.0344 1.0630 1.0927 1.1043 1.0934 1.1042 1.0996 1.0969 1.0883 1.1023 1.1042 1.1054 1.0893 1.0990 1.0735 1.0660
irintensity: 3.1913 1.4010 1.2219 1.7809 8.4939 0.1526 0.3510 5.1182 1.4349 1.8482 0.3197 4.4708 0.8443 2.2746 3.1339 18.9980 5.8344 71.0111 17.3112 4.0668 6.8152 9.7908 2.9374 1.7992 10.4222 5.9339 6.8896 4.6210 3.5158 12.0356 6.1133 0.6305 0.7438 0.8247 1.3786 7.0445 2.4392 16.2565 6.5634 13.4121 19.9694 24.0845 110.9605 62.1073 27.7611 9.2131 15.6741 2.2121 1.1703 0.8646 3.9975 12.1717 13.3365 2.1783 36.1510 120.9584 9.0038 31.1244 64.9250 45.0375 30.5851 47.5720 2.7160 3.6556 3.0215 10.0355 18.0440 16.9460 1.2789 22.0826 26.8227 16.7829 26.4633 33.3427 14.9762 23.1829 18.8755 40.8695 13.2678 29.1303 61.4689 29.3778 51.1491 13.6804 31.7594 120.6898 6.6932 88.1405 9.9752 36.8044 7.3038 43.5005 20.7727 21.2725 7.1869 6.2028 23.7270 1.4058 4.1904 21.3259 19.4852 7.3410 21.3593 5.7359 12.3996 30.6498 36.2429 10.1741 9.7174 37.7886 102.8088 35.0847 40.1323 98.4263 54.2074 36.3913 46.2271 25.0486 25.5279 26.8207 48.6745 10.9932 26.8784 19.9173 20.0356 12.6778 34.0568 2.0385 25.7660
temp: 298.150 k
press: 1.00000 atm
elementType: 8 8 8 8 7 6 6 6 6 6 6 6 6 6 6 6 6 6 6 6 6 6 6 6 1 1 1 1 1 1 1 1 1 1 1 1 1 1 1 1 1 1 1 1 1
symmnumber: 1
zpe: 949904.6 jmol-1
zpe.correction: 0.361800 hartree
zpe.thermalcorrener: 0.384317 hartree
zpe.thermalcorrenthalpy: 0.385261 hartree
zpe.thermalcorrgfe: 0.311470 hartree
zpe.sumelectzpe: -1090.450398 hartree
zpe.sumelectthermal: -1090.427881 hartree
zpe.sumelectthermalent: -1090.426937 hartree
zpe.sumelectthermalfe: -1090.500728 hartree
dipole: 0.5639 -2.7136 -0.1448
dipole: 2.7753
quadrupole: -124.8213 -130.1276 -136.1937
quadrupole: 2.9537 -3.5063 5.6147
quadrupole: 5.5595 0.2533 -5.8128 2.9537 -3.5063 5.6147
hfenergy: -1090.812198 hartree
pointgroup: C01 [X(C19H21N1O4)]
dipole: 0.1148949 1.0858082 0.0081387 debye
polarizability: 318.4248886|0.7260602|252.1317153|-3.9873753|7.3770799|139.4414581 unknown
InChI: InChI=1S/C19H21NO4/c1-22-17-11-7-8-20-12-9-10-5-4-6-13(21)14(10)16(15(11)12)18(23-2)19(17)24-3/h4-6,12,20-21H,7-9H2,1-3H3
charge 0 multiplicity 1
45 atoms
O  3.851439 -0.324458 -0.225984
O  -0.242052 2.414746 -0.707868
O  2.567183 2.281001 -0.724612
O  -1.848718 2.11078 1.439664
N  0.140234 -3.71639 -0.201137
C  -0.583566 -2.472327 0.150933
C  0.285096 -1.204776 0.060835
C  -1.817697 -2.284243 -0.762713
C  1.691387 -1.301694 -0.013402
C  -0.387163 0.054722 -0.020688
C  2.410281 -2.642047 0.087707
C  1.449833 -3.786465 0.496729
C  -2.605543 -1.066322 -0.310415
C  -1.86469 0.07561 0.125411
C  2.464355 -0.113596 -0.182441
C  0.388631 1.197436 -0.340555
C  1.810713 1.133518 -0.374289
C  -2.583931 1.129228 0.759641
C  -4.016381 -1.07592 -0.25815
C  -4.000133 1.132641 0.784786
C  -4.715977 0.040456 0.253178
C  4.786813 0.75981 0.118117
C  -0.16176 2.677551 -2.164312
C  2.433593 3.420905 0.213521
H  -0.947915 -2.587792 1.194188
H  -2.444361 -3.192539 -0.725272
H  -1.464866 -2.162226 -1.810301
H  2.8832 -2.87569 -0.888321
H  3.250681 -2.555647 0.802762
H  0.269324 -3.777392 -1.224356
H  1.914075 -4.769519 0.298012
H  1.2432 -3.736365 1.583206
H  -4.563769 -1.958393 -0.60707
H  -4.536165 1.971305 1.248827
H  -5.811112 0.044494 0.276738
H  -2.443191 2.839745 1.745564
H  5.759644 0.256283 0.235971
H  4.498221 1.243137 1.071341
H  4.828989 1.51702 -0.679604
H  -0.693488 1.884745 -2.724332
H  0.891293 2.737915 -2.495244
H  -0.666741 3.644414 -2.316418
H  3.007022 4.244408 -0.2402
H  2.865937 3.155578 1.198434
H  1.372369 3.700549 0.327617
